{"text_format":"1","workbook":"xlsx","n_sheets":7,"sheets":["Übersicht","Dateneingabe","SD_Linien","SD_Verteilung","MNID","Datenbasis","Speicherung"],"not_rendered":{"charts":7,"images":6,"macros":1,"external_links":0,"defined_names":37,"comments":1,"pivot_tables":0},"unopened":[],"bounds":{"document_bytes":16777216,"sheet_cells":100000,"rows_first":2000,"rows_last":500,"rows_between":2000,"halvings":0,"cell_chars":16384,"cell_head_chars":4096},"cells_cut":0,"cells_raw":0,"read":"whole","date_system":"1900"}

{"sheet":"Übersicht","index":0,"n_rows":17,"n_cols":10,"rows_kept":17,"cut":false,"hidden":false,"merged":[]}
[]
[null,"(0) M - N - Interaktionsdiagramme nach DIN EN 1992-1-1  (EC2)"]
[null,"zur Bemessung von symmetrisch bewehrten Rechteck- und Kreisprofilen aus Stahlbeton"]
[]
[null,"Zur Auswahl stehen:",null,"Rechteckquerschnitt mit Rand- und umlaufender Bewehrungsanordnung"]
[null,null,null,"Kreisquerschnitte mit umlaufender Bewehrungsanordnung"]
[null,null,null,"Normalbetone von C 12/15 bis C 100/115"]
[null,null,null,"Leichbetone von LC 12/13 bis LC 60/66"]
[null,null,null,"Beliebige Bemessungsschnittgrößen NEd und MEd"]
[]
[null,"Berechnet werden:",null,"Spannungs-Dehnungsverlauf für ausgewählten Beton"]
[null,null,null,"Verteilung der Spannungen und Dehnungen über Querschnittshöhe"]
[null,null,null,"M-N-Interaktionsdiagramm zum Ablesen des Bewehrungsgrades"]
[null,null,null,"erforderliche Bewehrung für ausgewählten Querschnitt und vorgegebene …"]
[null,null,null,"                                   … Kombination der Bemessungsschnittgrößen"]
[]
[null,"Darstellung:",null,null,null,null,null,null,null,"(Version: 05/21)"]

{"sheet":"Dateneingabe","index":1,"n_rows":27,"n_cols":11,"rows_kept":27,"cut":false,"hidden":false,"merged":[]}
[]
[null,"[1] Dateneingabe",null,{"$f":"IF(Datenbasis!K116=\"Nein\",\"\",\"Bitte Diagramme neu berechnen!\")","v":""},null,null,null,null,null,null,"weiter"]
[null,null,null,null,null,null,"Beiwert für Bauteileigenschaften",null,null,null,"Dimension"]
[null,"Teilsicherheitsbeiwert",null,null,null,"gc =",{"$f":"Datenbasis!E9","v":1.5},"Teilsicherheitsbeiwert für Beton",null,null,"[ - ]"]
[null,null,null,null,null,"gs =",{"$f":"Datenbasis!F9","v":1.1499999999999999},"Teilsicherheitsbeiwert für Betonstahl",null,null,"[ - ]"]
[]
[null,"Betonfestigkeitsklasse",null,null,null,null,"Parameter der Spannungs-Dehnungslinie des Betons"]
[null,null,null,null,null,"fcd =",{"$f":"Datenbasis!$G$23","v":1.4166666666666667},"Bemessungswert für die Druckfestigkeit",null,null,"[kN/cm²]"]
[null,null,"Betonstauchung bei ed/ h £ 0,1 bis eyd zulassen",null,null,"ec2 =",{"$f":"Datenbasis!$D$23","v":-2},"Betondehnung bei Erreichen von fcd",null,null,"[o/oo]"]
[null,null,"mit ed = MEd / NEd",null,null,"ec2u =",{"$f":"Datenbasis!$E$23","v":-3.5},"Grenzdehnung am Druckrand",null,null,"[o/oo]"]
[null,null,"ed / h =",{"$f":"ABS(I19/G19/I22*100)","v":0.41666666666666669},null,"n =",{"$f":"Datenbasis!$F$23","v":2},"Fülligkeitsbeiwert für Parabelfunktion",null,null,"[ - ]"]
[]
[null,"Betonstahlgüte",null,null,null,null,"Parameter der Spannungs-Dehnungslinie des Betonstahls"]
[null,null,null,null,null,"fyd =",{"$f":"Datenbasis!E16","v":43.478260869565219},"Bemessungswert für die Streckgrenze",null,null,"[kN/cm²]"]
[null,null,null,null,null,"ftd =",{"$f":"Datenbasis!F16","v":45.652173913043484},"Bemessungswert für die Zugfestigkeit ",null,null,"[kN/cm²]"]
[null,null,null,null,null,"Es =",{"$f":"Datenbasis!G14","v":20000},"Elastizitätsmodul des Bewehrungsstahls",null,null,"[kN/cm²]"]
[]
[null,"Bemessungsschnittgrößen",null,null,"(inkl. Teilsicherheitsbeiwert)",null,"Eingabe der Schnittgrößenkombination"]
[null,null,null,null,null," NEd = ",-4000,"MEd =",1000,null,"[kN]; [kNm]"]
[null,"Querschnittsart"]
[null,null,null,null,null,null,"Parameter für Bewehrungslage und Querschnittsabmessungen"]
[null,null,null,null,null,"b =",40,"h =",60,null,"[cm]; [cm]"]
[null,null,null,null,null,"b0 =",0,"h0 =",0,{"$f":"Datenbasis!P8","v":""},"[cm]; [cm]"]
[null,null,null,null,null,"A =",{"$f":"Datenbasis!O8","v":2400},"A / (b∙h) =",{"$f":"Datenbasis!N8","v":1},null,"[cm²]; [ - ]"]
[]
[null,null,null,null,null,"d1/ h =",0.05," Bezogene Bewehrungslage (d1/ h = d2/ h)",null,null,"[ - ]"]
[null,null,null,null,null,"d1 =",{"$f":"G26*I22","v":3},null,null,null,"[cm]"]

{"sheet":"SD_Linien","index":2,"n_rows":4,"n_cols":11,"rows_kept":4,"cut":false,"hidden":false,"merged":[]}
[]
[null,"(2) Spannungs-Dehnungslinien für ausgewählte Werkstoffe",null,null,null,null,null,null,null,"zurück","weiter"]
[]
[null,null,null,"Spannungs-Dehnungslinie für ",null,"und ",null," bei einer"]

{"sheet":"SD_Verteilung","index":3,"n_rows":23,"n_cols":11,"rows_kept":23,"cut":false,"hidden":false,"merged":[[7,6,17,6]]}
[]
[null,"(3) Dehnungs- und Spannungsverteilung über Querschnittshöhe infolge NEd und MEd"]
[]
[null,null,null,"Betongüte",null,"    bei einer",null,null,null,"zurück","weiter"]
[null,{"$f":"CONCATENATE(\"Dehnungsverteilung für DZ = \",F18)","v":"Dehnungsverteilung für DZ = 58"},null,null,null,null,null,"zugehörige Beton-Spannungsverteilung (mit Resultierender)"]
[null,null,null,null,null,"DZ"]
[null,null,null,null,null,1,"Rand (2)"]
[null,null,null,null,null,null,"am normierten Querschnitt (h = 1,0 m)"]
[]
[]
[]
[]
[]
[]
[]
[]
[]
[null,null,null,null,null,{"$f":"Datenbasis!K17","v":58}]
[null,null,null,null,null,80,"Rand (1)"]
[]
[null,null,"[ 0/00 ]",null,"[ 0/00 ]",null,"[kN/cm²]",null,"[kN/cm²]",null,"[m]"]
[null,"ec2 =",{"$f":"Datenbasis!X124*1000","v":-3.5},"es2 =",{"$f":"Datenbasis!X7*1000","v":-3.2814645308924484},"sc2 =",{"$f":"Datenbasis!Y124","v":-1.4166666666666667},"ss2(*) =",{"$f":"Datenbasis!Y7","v":-43.583741963604666},"zRc =",{"$f":"Datenbasis!P44","v":-0.16688168690986166}]
[null,"ec1 =",{"$f":"Datenbasis!X125*1000","v":0.870709382151029},"es1 =",{"$f":"Datenbasis!X18*1000","v":0.65217391304347749},"sc1 =",{"$f":"Datenbasis!Y125","v":0},"ss1(*) =",{"$f":"Datenbasis!Y18","v":13.043478260869549},"(*) =","ggf. abzügl. sc"]

{"sheet":"MNID","index":4,"n_rows":25,"n_cols":11,"rows_kept":25,"cut":false,"hidden":false,"merged":[[4,0,24,0]]}
[]
[null,"(4) M-N-Interaktionsdiagramme für ausgewählten Querschnitt",null,null,null,null,null,null,null,"zurück"]
[null,"Bemessungssituation",null,{"$f":"Datenbasis!F7","v":"Grundkombination"},null,"Querschnitt",{"$f":"Datenbasis!L6","v":"Rechteck mit As1 = As2"},null,{"$f":"CONCATENATE(\"(\" & Datenbasis!G4 & \")\")","v":"(Beton-Bruttoquerschnitt)"}]
[]
[{"$f":"Dateneingabe!D2","v":""},null,null,null,null,null,null,"Betongüte",{"$f":"Datenbasis!B61","v":"C 25/30"}]
[null,null,null,null,null,null,null,null,{"$f":"CONCATENATE(\"f_ yd = \",ROUND(10*Datenbasis!G61,3))","v":"f_ yd = 14,167"},"[MN/m²]"]
[null,null,null,null,null,null,null,"Bewehrung",{"$f":"Datenbasis!E14","v":"B 500 SA"},{"$f":"Datenbasis!F14","v":"ftd > fyd"}]
[null,null,null,null,null,null,null,null,"fyd / fcd =",{"$f":"Datenbasis!E16/Datenbasis!G61","v":30.690537084398976}]
[null,null,null,null,null,null,null,"Abmessung",{"$f":"CONCATENATE(\"b / h = \" & Dateneingabe!G22 & \" cm / \" & Dateneingabe!I22 & \" cm\")","v":"b / h = 40 cm / 60 cm"}]
[null,null,null,null,null,null,null,null,{"$f":"CONCATENATE(\"b0 / h0 = \" & Dateneingabe!G23 & \" cm / \" & Dateneingabe!I23 & \" cm\")","v":"b0 / h0 = 0 cm / 0 cm"}]
[null,null,null,null,null,null,null,"Bew.-lage","d1 / h = d2 / h =",{"$f":"Datenbasis!P6","v":0.05},1]
[null,null,null,null,null,null,null,{"$f":"CONCATENATE(\"Dehnungen bei interp. DZ = \", ROUND(Datenbasis!G104,1))","v":"Dehnungen bei interp. DZ = 58,4"}]
[null,null,null,null,null,null,null,"ec2 =",{"$f":"Datenbasis!G107","v":-3.5},"[o/oo]"]
[null,null,null,null,null,null,null,"es2 =",{"$f":"Datenbasis!G108","v":-3.286595081433247},"[o/oo]"]
[null,null,null,null,null,null,null,"es1 =",{"$f":"Datenbasis!G109","v":0.55469345276830517},"[o/oo]"]
[null,null,null,null,null,null,null,"ec1 =",{"$f":"Datenbasis!G110","v":0.76809837133505809},"[o/oo]"]
[null,null,null,null,null,null,null,"Bemessungsschnittgrößen"]
[null,null,null,null,null,null,null,"NEd =",{"$f":"Datenbasis!C103","v":-4000},"[kN]"]
[null,null,null,null,null,null,null,"MEd =",{"$f":"Datenbasis!C104","v":1000},"[kNm]"]
[null,null,null,null,null,null,null,"Bemessung"]
[null,null,null,null,null,null,null,{"$f":"IF(OR(I24>2,I24<0),\"nicht zulässig\",\"\")","v":""},null,null,{"$f":"Datenbasis!K17","v":58}]
[null,null,null,null,null,null,null,"nEd = ",{"$f":"Datenbasis!C105","v":-1.1764705882352942},"[ - ]",80]
[null,null,null,null,null,null,null,"mEd =",{"$f":"Datenbasis!C106","v":0.49019607843137253},"[ - ]"]
[null,null,null,null,null,null,null,"wtot = ",{"$f":"Datenbasis!G103","v":1.3643210707338145},{"$f":"CONCATENATE(\"[ - ]   bei DZ  =  \", ROUND(Datenbasis!G104,1))","v":"[ - ]   bei DZ  =  58,4"}]
[null,null,null,null,null,null,null,"erf As,tot = ",{"$f":"I24*Datenbasis!C107/J8","v":106.6899077313843},{"$f":"IF(Datenbasis!J6=1, \"[cm²]  =  As1 + As2\",\"[cm²]\")","v":"[cm²]  =  As1 + As2"}]

{"sheet":"Datenbasis","index":5,"n_rows":129,"n_cols":33,"rows_kept":129,"cut":false,"hidden":false,"merged":[[1,18,1,20],[10,1,10,3],[11,1,11,3],[6,9,6,10],[5,11,5,12],[9,9,9,10],[10,9,10,10],[11,9,11,10],[20,19,20,20],[20,21,20,22],[12,9,12,10],[13,9,13,10],[7,9,7,10]]}
[]
[null,"Betonart","Stahllinie","Druckstauchung bei geringer Ausmitte",null,null,"Netto-Beton",null,null,"außen","[cm]","innen","[cm]",null,"Bew.-Lage","Einheits-Querschn. [cm]",null,null,{"$f":"INDEX(Datenbasis!J10:J14,J6)","v":"Rechteck mit As1 = As2"}]
[null,1,{"$f":"IF(C5,1,2)","v":2},{"$f":"IF(B3=2,2,IF(D5,1,2))","v":1},null,null,{"$f":"IF(G5,1,0)","v":0},null,null,"h =",{"$f":"Dateneingabe!I22","v":60},"h0 =",{"$f":"Dateneingabe!I23","v":0},null,"h =",{"$f":"Q4-Q3","v":100},-50,null,"eps_0 =",{"$f":"L17","v":-1.3146453089244855E-3},"kappa =",{"$f":"M17","v":4.3707093821510291E-3},"d1/h =",{"$f":"P4/GDicke","v":0.05},"As,tot =",{"$f":"Q17","v":423.58333333333337}]
[null,"Normalb. = 1","Lin. I/II = 1/2","nur bei Normalbeton und ed / h <=0,1",null,null,{"$f":"IF(G5,\"Beton-Nettoquerschnitt\",\"Beton-Bruttoquerschnitt\")","v":"Beton-Bruttoquerschnitt"},null,null,"b =",{"$f":"Dateneingabe!G22","v":40},"b0 =",{"$f":"Dateneingabe!G23","v":0},null,"d1 = d2 =",{"$f":"Dateneingabe!G26*GDicke","v":5},50,null,null,null,null,null,null,{"$f":"X18","v":6.5217391304347744E-4},{"$f":"SDStahl(X4,$H$16,$H$14,$E$16,$F$16)","v":13.043478260869549}]
[null,"Leichtb. = 2",false,true,"zugel.=1; nicht zugel.=2",null,false,null,null,"h0 / h =",{"$f":"M3/K3","v":0},"b0 / b =",{"$f":"M4/K4","v":0},null,"d =",{"$f":"GDicke-P4","v":95},null,null,"Stahlfasern",{"$f":"Datenbasis!M8","v":2},"[cm²]",null,"[cm²]","[o/oo]","[kN/cm²]","[kN]","[kNm]",null,"Kreisquerschnitt (Hilfsrechnung)",null,null,"2*12 Eisen","gesAs / 12"]
[null,null,null,null,null,null,null,null,null,1,null,{"$f":"J8","v":"Rechteck mit As1 = As2"},null,null,"d1 / h =",{"$f":"P4/GDicke","v":0.05},null,null,"j","z(i) [m]","As(i)","z(i) [m]","As(i)","epss(j)","sigms(i)","ns(i)","ms(i)",null,"i","Winkel","alfa [BM]","z(i) [m]","As(i)"]
[null,1,"Kombinationsauswahl",null,null,{"$f":"INDEX(B11:B12,B7)","v":"Grundkombination"},null,null,null,"Auswahl:  Querschnitt",null,"Layer","Bewehrung","A / (b * h )","A [cm²]","Hinweis","Bild",null,1,{"$f":"(ROben+$P$4)/100","v":-0.45},{"$f":"IF($T$5=2,$Z$3/2,$Z$3/4)","v":211.79166666666669},{"$f":"IF($J$6>2,AF7,T7)","v":-0.45},{"$f":"IF($J$6>2,AG7,U7)","v":211.79166666666669},{"$f":"$T$3+T7*$V$3","v":-3.2814645308924485E-3},{"$f":"IF($G$3=0,SDStahl(X7,$H$16,$H$14,$E$16,$F$16),SDStahl(X7,$H$16,$H$14,$E$16,$F$16)-SDBeton(X7,$D$23/1000,$G$23,$F$23))","v":-43.583741963604666},{"$f":"W7*Y7","v":-9230.6733500417722},{"$f":"Z7*V7","v":4153.803007518798},null,1,7.5,{"$f":"-COS(AD7*PI()/180)","v":-0.99144486137381038},{"$f":"(GDicke/2-$P$4)*AE7/100","v":-0.44615018761821468},{"$f":"$Z$3/12","v":35.298611111111114}]
[null,"Kombination",null,null,"gam_c","gam_s",null,null,null,{"$f":"INDEX(J10:J14,$J$6)","v":"Rechteck mit As1 = As2"},null,{"$f":"INDEX(L10:L14,$J$6)","v":100},{"$f":"INDEX(M10:M14,$J$6)","v":2},{"$f":"INDEX(N10:N14,$J$6)","v":1},2400,"",{"$f":"INDEX(Q10:Q14,$J$6)","v":"QGrafik1"},null,2,{"$f":"$T$7+(GDicke-2*$P$4)/2000","v":-0.40500000000000003},{"$f":"IF($T$5=2,0,$Z$3/20)","v":0},{"$f":"IF($J$6>2,AF8,T8)","v":-0.40500000000000003},{"$f":"IF($J$6>2,AG8,U8)","v":0},{"$f":"$T$3+T8*$V$3","v":-3.0847826086956524E-3},{"$f":"SDStahl(X8,$H$16,$H$14,$E$16,$F$16)","v":-43.565010351966876},{"$f":"W8*Y8","v":0},{"$f":"Z8*V8","v":0},null,2,{"$f":"AD7+15","v":22.5},{"$f":"-COS(AD8*PI()/180)","v":-0.92387953251128674},{"$f":"(GDicke/2-$P$4)*AE8/100","v":-0.41574578963007902},{"$f":"$Z$3/12","v":35.298611111111114}]
[null,null,null,null,{"$f":"INDEX(E11:E12,$B$7)","v":1.5},{"$f":"INDEX(F11:F12,$B$7)","v":1.1499999999999999},null,null,null,null,null,"Layer","Bewehrung","A / (b * h )","A [cm²]","Hinweis","Bild",null,3,{"$f":"$T$7+(GDicke-2*$P$4)/2000*3","v":-0.315},{"$f":"$U$8","v":0},-0.315,0,-2.6914187643020597E-3,-43.527547128691296,0,0,null,3,{"$f":"AD8+15","v":37.5},-0.79335334029123517,-0.35700900313105582,35.298611111111114]
[null,"Kombination",null,null,"gam_c","gam_s",null,null,null,"Rechteck mit As1 = As2",null,100,2,{"$f":"O10/$K$3/$K$4","v":1},{"$f":"$K$3*$K$4-$M$3*$M$4","v":2400},{"$f":"\"\"","v":""},"QGrafik1",null,4,{"$f":"$T$7+(GDicke-2*$P$4)/2000*5","v":-0.22500000000000003},0,-0.22500000000000003,0,-2.298054919908467E-3,-43.490083905415716,0,0,null,4,52.5,-0.60876142900872066,-0.2739426430539243,35.298611111111114]
[null,"Grundkombination",null,null,1.5,1.1499999999999999,null,null,null,"I- / H-Profil mit As1 = As2",null,100,2,{"$f":"O11/$K$3/$K$4","v":1},{"$f":"$K$3*$K$4-$M$3*$M$4","v":2400},"<-- Eingabe !","QGrafik2",null,5,{"$f":"$T$7+(GDicke-2*$P$4)/2000*7","v":-0.13500000000000001},0,-0.13500000000000001,0,-1.9046910755148745E-3,-38.093821510297488,0,0,null,5,67.5,-0.38268343236508984,-0.17220754456429041,35.298611111111114]
[null,"Außergewöhnliche Kombination",null,null,1.3,1,null,null,null,"Hohlprofil mit umlfd. As,tot",null,100,12,1,2400,"<-- Eingabe !","QGrafik3",null,6,{"$f":"$T$7+(GDicke-2*$P$4)/2000*9","v":-4.500000000000004E-2},0,-4.500000000000004E-2,0,-1.5113272311212821E-3,-30.226544622425642,0,0,null,6,82.5,-0.13052619222005171,-5.8736786499023273E-2,35.298611111111114]
[null,null,null,null,null,null,null,null,null,"Rechteck mit umlfd. As,tot",null,100,12,1,2400,{"$f":"\"\"","v":""},"QGrafik3",null,7,{"$f":"$T$7+(GDicke-2*$P$4)/2000*11","v":4.4999999999999984E-2},0,4.4999999999999984E-2,0,-1.1179633867276894E-3,-22.359267734553789,0,0,null,7,97.5,0.13052619222005138,5.8736786499023121E-2,35.298611111111114]
[null,1,"Stahlparameter",null,{"$f":"INDEX(B18:B19,B14)","v":"B 500 SA"},{"$f":"IF(C3=2,\"ftd > fyd\",\"fyd = ftd\")","v":"ftd > fyd"},20000,2.5000000000000001E-2,null,"Ellipsoid mit umlfd. As,tot",null,100,12,0.78539816339744828,{"$f":"PI()/4*($K$3*$K$4-$M$3*$M$4)","v":1884.9555921538758},"<-- Eingabe !","QGrafik4",null,8,{"$f":"$T$7+(GDicke-2*$P$4)/2000*13","v":0.13499999999999995},0,0.13499999999999995,0,-7.2459954233409683E-4,-14.491990846681936,0,0,null,8,112.5,0.38268343236508973,0.17220754456429038,35.298611111111114]
[null,"Stahlgüte","f_yk","f_tk","f_yd","f_td","eps_yk","eps_yd",null,"",null,null,null,null,null,null,null,null,9,{"$f":"$T$7+(GDicke-2*$P$4)/2000*15","v":0.22499999999999992},0,0.22499999999999992,0,-3.3123569794050426E-4,-6.6247139588100854,0,0,null,9,127.5,0.60876142900872066,0.2739426430539243,35.298611111111114]
[null,null,{"$f":"INDEX(C18:C19,$B$14)","v":50},{"$f":"INDEX(D18:D19,$B$14)","v":52.5},{"$f":"INDEX(E18:E19,$B$14)","v":43.478260869565219},{"$f":"IF(C3=2,INDEX(F18:F19,$B$14),E16)","v":45.652173913043484},{"$f":"INDEX(G18:G19,$B$14)","v":2.5000000000000001E-3},{"$f":"INDEX(H18:H19,$B$14)","v":2.1739130434782609E-3},null,"Koeffizienten",null,"eps_0","kappa",null,14,"Bewehrungsgrad",null,null,10,{"$f":"$T$7+(GDicke-2*$P$4)/2000*17","v":0.315},0,0.315,0,6.2128146453088642E-5,1.2425629290617728,0,0,null,10,142.5,0.79335334029123528,0.35700900313105582,35.298611111111114]
[null,"Stahlgüte","f_yk","f_tk","f_yd","f_td","eps_yk","eps_yd",null,null,58,{"$f":"L19/1000-M17*ROben/100","v":-1.3146453089244855E-3},{"$f":"(M19-L19)/P5/10","v":4.3707093821510291E-3},null,null,{"$f":"INDEX(P19:P39,$O$16)","v":4.2358333333333338E-2},{"$f":"INDEX(Q19:Q39,$O$16)","v":423.58333333333337},null,11,{"$f":"$T$7+(GDicke-2*$P$4)/2000*19","v":0.40499999999999997},0,0.40499999999999997,0,4.554919908466811E-4,9.1098398169336221,0,0,null,11,157.5,0.92387953251128674,0.41574578963007902,35.298611111111114]
[null,"B 500 SA",50,52.5,{"$f":"C18/F9","v":43.478260869565219},{"$f":"D18/F9","v":45.652173913043484},{"$f":"C18/G14","v":2.5000000000000001E-3},{"$f":"E18/G14","v":2.1739130434782609E-3},null,"eps_c1 ",null,"eps_c2","eps_s1",null,"omega","mue","As,tot [cm²]",null,12,{"$f":"(RUnten-$P$4)/100","v":0.45},{"$f":"$U$7","v":211.79166666666669},0.45,211.79166666666669,6.5217391304347744E-4,13.043478260869549,2762.4999999999968,1243.1249999999986,null,12,172.5,0.99144486137381038,0.44615018761821468,35.298611111111114]
[null,"B 500 MA",50,52.5,{"$f":"C19/F9","v":43.478260869565219},{"$f":"D19/F9","v":45.652173913043484},{"$f":"C19/G14","v":2.5000000000000001E-3},{"$f":"E19/G14","v":2.1739130434782609E-3},null,{"$f":"(L17+RUnten/100*M17)*1000","v":0.870709382151029},null,{"$f":"INDEX(L21:L100,$K$17)","v":-3.5},{"$f":"INDEX(M21:M100,$K$17)","v":0.65217391304347783},null,0,{"$f":"O19*$G$61/$E$16","v":0},{"$f":"P19*$N$8*10000","v":0},null,null,{"$f":"SUM(T7:T18)","v":-4.4408920985006262E-16},{"$f":"SUM(U7:U18)","v":423.58333333333337},{"$f":"SUM(V7:V18)","v":-4.4408920985006262E-16},{"$f":"SUM(W7:W18)","v":423.58333333333337},null,null,{"$f":"SUM(Z7:Z18)","v":-6468.1733500417758},{"$f":"SUM(AA7:AA18)","v":5396.9280075187962},null,null,null,null,{"$f":"SUM(AF7:AF18)","v":0},{"$f":"SUM(AG7:AG18)","v":423.58333333333326}]
[null,null,null,null,null,null,null,null,null,"Dehnungszustände",null,"eps_c2","eps_s1",null,0.1,3.258333333333334E-3,32.583333333333343,null,null,null,null,null,null,{"$f":"X4","v":6.5217391304347744E-4},{"$f":"SDBeton(X20,$D$23/1000,$G$23,$F$23)","v":0}]
[null,4,"Parabel-Rechteck-Diagramm (Normalbeton)",null,null,null,{"$f":"INDEX(B25:B39,$B$21)","v":"C 25/30"},0.85,null,"Bereich -1",1,{"$f":"M21","v":25},{"$f":"$M$33","v":25},null,0.2,6.516666666666668E-3,65.166666666666686,null,"Betonfasern","re = Rechteckumriss",null,"el = Ellipsoid",null,"[o/oo]","[kN/cm²]","[kN]","[kNm]"]
[null,"Betongüte","f_ck","eps_c2","eps_c2u","n","f_cd",null,null,null,2,{"$f":"L21/2","v":12.5},25,null,0.3,9.774999999999999E-3,97.749999999999986,null,"i","z(i,re) [m]","A(i,re) [m²]","z(i,el) [m]","A(i,el) [m²]","epsb(i)","sigmb(i)","nb(i)","mb(i)"]
[null,null,{"$f":"INDEX(C25:C39,$B$21)","v":25},{"$f":"INDEX(D25:D39,$B$21)","v":-2},{"$f":"INDEX(E25:E39,$B$21)","v":-3.5},{"$f":"INDEX(F25:F39,$B$21)","v":2},{"$f":"INDEX(G25:G39,$B$21)","v":1.4166666666666667},null,null,"Bereich 1-2",3,0,25,null,0.4,1.3033333333333336E-2,130.33333333333337,null,1,-0.495,0.01,-0.49400344850503036,1.3293261625554919E-3,{"$f":"$T$3+$V$3*IF($J$6<5,T23,V23)","v":-3.478146453089245E-3},{"$f":"SDBeton(X23,$D$23/1000,$G$23,$F$23)","v":-1.4166666666666667},{"$f":"Y23*IF($J$6<5,U23,W23)*10000","v":-141.66666666666669},{"$f":"Z23*IF($J$6<5,T23,V23)","v":70.125000000000014}]
[null,"Betongüte","f_ck","eps_c2","eps_c2u","n","f_cd",null,null,{"$f":"L33/(K33-K23)","v":-0.35},4,{"$f":"L23+$J$24","v":-0.35},25,null,0.5,1.6291666666666666E-2,162.91666666666666,null,2,-0.48500000000000004,0.01,-0.4847226655459122,2.4192011395264305E-3,{"$f":"$T$3+$V$3*IF($J$6<5,T24,V24)","v":-3.434439359267735E-3},{"$f":"SDBeton(X24,$D$23/1000,$G$23,$F$23)","v":-1.4166666666666667},{"$f":"Y24*IF($J$6<5,U24,W24)*10000","v":-141.66666666666669},{"$f":"Z24*IF($J$6<5,T24,V24)","v":68.708333333333343}]
[null,"C 12/15",12,-2,-3.5,2,{"$f":"C25/10/$E$9*$H$21","v":0.67999999999999994},null,null,null,5,-0.7,25,null,0.6,1.9549999999999998E-2,195.49999999999997,null,3,-0.47499999999999998,0.01,-0.47483679963055642,3.1169841027679909E-3,-3.3907322654462241E-3,{"$f":"SDBeton(X25,$D$23/1000,$G$23,$F$23)","v":-1.4166666666666667},-141.66666666666669,67.291666666666671]
[null,"C 16/20",16,-2,-3.5,2,0.90666666666666662,null,null,null,6,-1.0499999999999998,25,null,0.7,2.2808333333333333E-2,228.08333333333334,null,4,-0.46499999999999997,0.01,-0.46488497496898201,3.6722264558944808E-3,-3.347025171624714E-3,{"$f":"SDBeton(X26,$D$23/1000,$G$23,$F$23)","v":-1.4166666666666667},-141.66666666666669,65.875]
[null,"C 20/25",20,-2,-3.5,2,1.1333333333333333,null,null,null,7,-1.4,25,null,0.8,2.6066666666666672E-2,260.66666666666674,null,5,-0.45500000000000002,0.01,-0.45491163053910294,4.1437388586560327E-3,-3.3033180778032039E-3,{"$f":"SDBeton(X27,$D$23/1000,$G$23,$F$23)","v":-1.4166666666666667},-141.66666666666669,64.458333333333343]
[null,"C 25/30",25,-2,-3.5,2,1.4166666666666667,null,null,null,8,-1.75,25,null,0.9,2.9325000000000004E-2,293.25000000000006,null,6,-0.44500000000000001,0.01,-0.44492857436495725,4.5578444998897686E-3,-3.2596109839816935E-3,-1.4166666666666667,-141.66666666666669,63.041666666666679]
[null,"C 30/37",30,-2,-3.5,2,1.7,null,null,null,9,-2.1,25,null,1,3.2583333333333332E-2,325.83333333333331,null,7,-0.435,0.01,-0.43494030657813915,4.9291252886183093E-3,-3.2159038901601834E-3,-1.4166666666666667,-141.66666666666669,61.625000000000007]
[null,"C 35/45",35,-2,-3.5,2,1.9833333333333334,null,null,null,10,-2.4500000000000002,25,null,1.1000000000000001,3.5841666666666674E-2,358.41666666666674,null,8,-0.42499999999999999,0.01,-0.42494891796911427,5.2666858813611604E-3,-3.1721967963386729E-3,-1.4166666666666667,-141.66666666666669,60.208333333333343]
[null,"C 40/50",40,-2,-3.5,2,2.2666666666666666,null,null,null,11,-2.8000000000000003,25,null,1.2,3.9099999999999996E-2,390.99999999999994,null,9,-0.41499999999999998,0.01,-0.41495551266296155,5.5766728441447458E-3,-3.1284897025171624E-3,-1.4166666666666667,-141.66666666666669,58.791666666666671]
[null,"C 45/55",45,-2,-3.5,2,2.5499999999999998,null,null,null,12,-3.1500000000000004,25,null,1.3,4.2358333333333338E-2,423.58333333333337,null,10,-0.40500000000000003,0.01,-0.40496072889950996,5.8634719649066549E-3,-3.0847826086956524E-3,-1.4166666666666667,-141.66666666666669,57.375000000000014]
[null,"C 50/60",50,-2,-3.5,2,2.8333333333333335,null,null,"Bereich 2-3",13,{"$f":"E61","v":-3.5},{"$f":"H14*1000","v":25},null,1.4,4.5616666666666666E-2,456.16666666666669,null,11,-0.39499999999999996,0.01,-0.3949649613775294,6.1303449839805778E-3,-3.0410755148741419E-3,-1.4166666666666667,-141.66666666666669,55.958333333333336]
[null,"C 55/67",55,-2.2000000000000002,-3.1,1.75,3.1166666666666663,null,null,{"$f":"(M33-M71)/(K71-K33)","v":0.60068649885583525},14,{"$f":"$L$33","v":-3.5},{"$f":"M33-$J$34","v":24.399313501144164},null,1.5,4.8875000000000002E-2,488.75,null,12,-0.38500000000000001,0.01,-0.38496846733217793,6.3797970120675037E-3,-2.9973684210526318E-3,-1.4166666666666667,-141.66666666666669,54.541666666666679]
[null,"C 60/75",60,-2.2999999999999998,-2.9,1.6,3.4,null,null,null,15,-3.5,23.798627002288328,null,1.6,5.2133333333333344E-2,521.33333333333348,null,13,-0.375,0.01,-0.37497142160200791,6.6138021850213015E-3,-2.9536613272311213E-3,-1.4166666666666667,-141.66666666666669,53.125000000000007]
[null,"C 70/85",70,-2.4,-2.7,1.45,3.9666666666666668,null," ",null,16,-3.5,23.197940503432491,null,1.7,5.5391666666666665E-2,553.91666666666663,null,14,-0.36499999999999999,0.01,-0.36497394718459625,6.8339492612143476E-3,-2.9099542334096113E-3,-1.4166666666666667,-141.66666666666669,51.708333333333336]
[null,"C 80/95",80,-2.5,-2.6,1.4,4.5333333333333332,null,null,null,17,-3.5,22.597254004576655,null,1.8,5.8650000000000008E-2,586.50000000000011,null,15,-0.35500000000000004,0.01,-0.3549761331322317,7.0415394059312082E-3,-2.8662471395881012E-3,-1.4166666666666667,-141.66666666666669,50.291666666666679]
[null,"C 90/105",90,-2.6,-2.6,1.4,5.0999999999999996,null,null,null,18,-3.5,21.996567505720819,null,1.9,6.1908333333333336E-2,619.08333333333337,null,16,-0.34499999999999997,0.01,-0.34497804551268102,7.2376540844091867E-3,-2.8225400457665903E-3,-1.4166666666666667,-141.66666666666669,48.875]
[null,"C 100/115",100,-2.6,-2.6,1.4,5.666666666666667,null,null,null,19,-3.5,21.395881006864983,null,2,6.5166666666666664E-2,651.66666666666663,null,17,-0.33500000000000002,0.01,-0.33497973438038886,7.4232035417031031E-3,-2.7788329519450802E-3,-1.4166666666666667,-141.66666666666669,47.458333333333343]
[null,null,null,null,null,null,null,null,null,null,20,-3.5,20.795194508009146,null,null,null,null,null,18,-0.32500000000000001,0.01,-0.32498123835567283,7.5989622607261723E-3,-2.7351258581235702E-3,-1.4166666666666667,-141.66666666666669,46.041666666666671]
[null,4,"Parabel-Rechteck-Diagramm (Leichtbeton)",null,null,null,{"$f":"INDEX(B45:B57,$B$41)","v":"LC 25/28"},0.75,null,null,21,-3.5,20.19450800915331,null,"Auswertung Betonfasern",null,null,null,19,-0.315,0.01,-0.31498258771768606,7.7655954399719462E-3,-2.6914187643020597E-3,-1.4166666666666667,-141.66666666666669,44.625000000000007]
[null,"Betongüte","f_ck","eps_c2","eps_c2u","n","f_cd","rho",null,null,22,-3.5,19.593821510297474,null,null,null,null,null,20,-0.30499999999999999,0.01,-0.3049838065451505,7.9236791270566685E-3,-2.6477116704805492E-3,-1.4166666666666667,-141.66666666666669,43.208333333333336]
[null,null,{"$f":"INDEX(C45:C57,$B$41)","v":25},-2,-2.6409090909090911,2,1.25,1300,null,null,23,-3.5,18.993135011441638,null,"min sigm_c=",{"$f":"MIN(Y23:Y122)","v":-1.4166666666666667},"[kN/m²]",null,21,-0.29499999999999998,0.01,-0.2949849142301878,8.0737157746437541E-3,-2.6040045766590391E-3,-1.4166666666666667,-141.66666666666669,41.791666666666671]
[null,"Betongüte","f_ck","eps_c2","eps_c2u","n","f_cd","rho",null,null,24,-3.5,18.392448512585801,null,"z_Rc =",{"$f":"IF(ISNUMBER(AA123/Z123),AA123/Z123,\"undef.\")","v":-0.16688168690986166},"[m]",null,22,-0.28500000000000003,0.01,-0.28498592656954264,8.2161464310470458E-3,-2.5602974828375291E-3,-1.4166666666666667,-141.66666666666669,40.375000000000007]
[null,"LC 12/13",12,-2,{"$f":"-3.5*(0.4+0.6*H45/2200)","v":-2.5454545454545454},2,{"$f":"C45/10/$E$9*$H$41","v":0.6},1200,null,null,{"$f":"K44+1","v":25},-3.5,17.791762013729965,null,"R_c =",{"$f":"Z123","v":-9183.8491898008742},"[kN]",null,23,-0.27500000000000002,0.01,-0.27498685656474386,8.3513604151454028E-3,-2.5165903890160186E-3,-1.4166666666666667,-141.66666666666669,38.958333333333343]
[null,"LC 16/18",16,-2,{"$f":"-3.5*(0.4+0.6*H46/2200)","v":-2.5454545454545454},2,0.8,1200,null,null,26,-3.5,17.191075514874129,null,"Hilfslinien in SD-Verteilung",null,null,null,24,-0.26500000000000001,0.01,-0.2649877150179068,8.4797030823732193E-3,-2.4728832951945081E-3,-1.4166666666666667,-141.66666666666669,37.541666666666671]
[null,"LC 20/22",20,-2,-2.6409090909090911,2,1,1300,null,null,27,-3.5,16.590389016018293,null,null,0,{"$f":"P44","v":-0.16688168690986166},null,25,-0.255,0.01,-0.25498851098166692,8.6014821224820529E-3,-2.429176201372998E-3,-1.4166666666666667,-141.66666666666669,36.125000000000007]
[null,"LC 25/28",25,-2,-2.6409090909090911,2,1.25,1300,null,null,28,-3.5,15.989702517162458,null,null,{"$f":"0.75*P43","v":-1.0625},{"$f":"Q47","v":-0.16688168690986166},null,26,-0.245,0.01,-0.24498925210324327,8.7169727140682818E-3,-2.3854691075514876E-3,-1.4166666666666667,-141.66666666666669,34.708333333333336]
[null,"LC 30/33",30,-2,-2.7363636363636363,2,1.5,1400,null,null,29,-3.5,15.389016018306624,null,"am Einheitsquerschnitt",null,null,null,27,-0.23499999999999999,0.01,-0.2349899448907207,8.826421778876891E-3,-2.3417620137299771E-3,-1.4166666666666667,-141.66666666666669,33.291666666666671]
[null,"LC 35/38",35,-2,-2.831818181818182,2,1.75,1500,null,null,30,-3.5,14.788329519450789,null,"M_Ed =",{"$f":"AA129","v":6929.5442526385323},"[kNm]",null,28,-0.22500000000000001,0.01,-0.22499059492116735,8.9300515198965508E-3,-2.298054919908467E-3,-1.4166666666666667,-141.66666666666669,31.875000000000004]
[null,"LC 40/44",40,-2,-2.831818181818182,2,2,1500,null,null,31,-3.5,14.187643020594955,null,"N_Ed =",{"$f":"Z129","v":-15652.02253984265},"[kN]",null,29,-0.215,0.01,-0.21499120700514496,9.0280623841935657E-3,-2.2543478260869569E-3,-1.4166666666666667,-141.66666666666669,30.458333333333336]
[null,"LC 45/50",45,-2,-2.9272727272727277,2,2.25,1600,null,null,32,-3.5,13.58695652173912,null,"mue_Ed =",{"$f":"P50/P55/GDicke/G61*100","v":0.48914430018624899},"[1]",null,30,-0.20500000000000002,0.01,-0.20499178531775186,9.1206355596054802E-3,-2.2106407322654465E-3,-1.4166666666666667,-141.66666666666669,29.041666666666671]
[null,"LC 50/55",50,-2,-2.9272727272727277,2,2.5,1600,null,null,33,-3.5,12.986270022883286,null,"nue_Ed =",{"$f":"P51/P55/G61","v":-1.1048486498712451},"[1]",null,31,-0.19499999999999998,0.01,-0.19499233350399633,9.2079350905851474E-3,-2.166933638443936E-3,-1.4166666666666667,-141.66666666666669,27.625]
[null,"LC 55/60",55,-2.2000000000000002,{"$f":"-3.1*(0.4+0.6*H54/2200)","v":-2.6772727272727272},1.75,2.75,1700,null,null,34,-3.5,12.385583524027451,null,"omega_tot =",{"$f":"INDEX(O19:O39,O16)","v":1.3},"[1]",null,32,-0.185,0.01,-0.18499285476421629,9.2901096804713038E-3,-2.1232265446224259E-3,-1.4166666666666667,-141.66666666666669,26.208333333333336]
[null,"LC 60/66",60,-2.2999999999999998,{"$f":"-2.9*(0.4+0.6*H55/2200)","v":-2.5836363636363635},1.6,3,1800,null,null,35,-3.5,11.784897025171617,null,"A_c =",{"$f":"10000*IF(J6<5,U123,W123)","v":10000.000000000007},"[cm²]",null,33,-0.17499999999999999,0.01,-0.17499335192376356,9.367294233682438E-3,-2.0795194508009154E-3,-1.4166666666666667,-141.66666666666669,24.791666666666668]
[null,"LC 70/77",70,-2.4,{"$f":"-2.7*(0.4+0.6*H56/2200)","v":-2.4422727272727274},1.45,3.5,1850,null,null,36,-3.5,11.184210526315782,null,null,null,null,null,34,-0.16500000000000001,0.01,-0.16499382749044678,9.4396111806995479E-3,-2.0358123569794054E-3,-1.4166666666666667,-141.66666666666669,23.375000000000004]
[null,"LC 80/88",80,-2.5,{"$f":"-2.6*(0.4+0.6*H57/2200)","v":-2.3872727272727272},1.4,4,1900,null,null,37,-3.5,10.583524027459948,null,"Darstellung des Dehnungszustandes",null,null,null,35,-0.155,0.01,-0.15499428370196652,9.5071716204300563E-3,-1.9921052631578949E-3,-1.4166445925669438,-141.66445925669439,21.95799118478763]
[null,null,null,null,null,null,null,null,null,null,38,-3.5,9.9828375286041133,null,"im M-N-Interaktionsdiagr.",null,{"$f":"K17","v":58},null,36,-0.14499999999999999,0.01,-0.14499472256552753,9.5700763080383434E-3,-1.9483981693363848E-3,-1.4157236097547248,-141.57236097547249,20.527992341443511]
[null,{"$f":"B3","v":1},"Betonart (Normal = 1; Leicht = 2)",null,null,null,null,"ed/h<=0,1",null,null,39,-3.5,9.3821510297482789,null,null,"Punkt A","Punkt B",null,37,-0.13499999999999998,0.01,-0.13499514589112097,9.6284165111835303E-3,-1.9046910755148743E-3,-1.4134494906568607,-141.34494906568608,19.081568123867619]
[null,"Betonart","fck","epsc2","epsc2u","n","fcd","epsc2 *",null,null,40,-3.5,8.7814645308924444,null,"mue_cd =",{"$f":"INDEX(Speicherung!E12:E91,Q58)","v":0.10818467612609894},{"$f":"INDEX(Speicherung!AS12:AS91,Q58)","v":0.69427640544940661},null,38,-0.125,0.01,-0.12499555531955697,9.6822747535019477E-3,-1.8609839816933643E-3,-1.4098222352733516,-140.98222352733518,17.622777940916897]
[null,{"$f":"IF(B3=1,G21,G41)","v":"C 25/30"},{"$f":"IF($B$3=1,C23,C43)","v":25},{"$f":"IF($B$3=1,D23,D43)","v":-2},{"$f":"IF($B$3=1,E23,E43)","v":-3.5},{"$f":"IF($B$3=1,F23,F43)","v":2},{"$f":"IF($B$3=1,G23,G43)","v":1.4166666666666667},{"$f":"IF(D3=1,-E16*1000/G14,D61)","v":-2.1739130434782608},null,null,41,-3.5,8.1807780320366099,null,"nue_cd =",{"$f":"INDEX(Speicherung!F12:F91,Q58)","v":-0.64827170751535534},{"$f":"INDEX(Speicherung!AT12:AT91,Q58)","v":-1.3506977726782623},null,39,-0.115,0.01,-0.11499595234634795,9.7317254608662064E-3,-1.8172768878718538E-3,-1.4048418436041976,-140.48418436041976,16.155681201448274]
[null,"Wertepaare für Darstellung der Spannungs-Dehnungsbeziehung ",null,null,null,null,"Hilfslinien für SD-Linien",null,null,null,42,-3.5,7.5800915331807746,null,"tot omega =",0,2,null,40,-0.105,0.01,-0.10499633834212467,9.7768355232840057E-3,-1.7735697940503435E-3,-1.3985083156493987,-139.85083156493988,14.684337314318688]
[null,"Param","epsc","sigmcd","sigmck",null,"epsc","sigmc",null,null,43,-3.5,6.9794050343249392,null,"Daten werden aus TB \"Speicherung\"",null,null,null,41,-9.5000000000000001E-2,0.01,-9.4996714570250468E-2,9.8176647831207716E-3,-1.7298627002288332E-3,-1.3908216514089549,-139.08216514089548,13.212805688385071]
[null,0,0,{"$f":"-(1-(1-C64/$D$61)^$F$61)*$G$61","v":0},{"$f":"-(1-(1-C64/$D$61)^$F$61)*$C$61/10","v":0},null,{"$f":"$D$61","v":-2},0,null,null,44,-3.5,6.3787185354691038,null,"übernommen",null,null,null,42,-8.4999999999999992E-2,0.01,-8.4997082202092497E-2,9.8542664585380638E-3,-1.686155606407323E-3,-1.3817818508828659,-138.1781850882866,11.74514573250436]
[null,1,{"$f":"C64+$D$61/20","v":-0.1},-0.13812500000000005,-0.24375000000000008,null,{"$f":"$D$61","v":-2},{"$f":"-G61","v":-1.4166666666666667},null,null,45,-3.5,5.7780320366132685,null,null,null,null,null,43,-7.4999999999999997E-2,0.01,-7.4997442330322836E-2,9.8866875095611328E-3,-1.6424485125858127E-3,-1.3713889140711322,-137.13889140711322,10.285416855533491]
[null,2,-0.2,-0.26916666666666661,-0.47499999999999981,null,{"$f":"$D$61","v":-2},{"$f":"-C61/10","v":-2.5},null,null,46,{"$f":"$L$33","v":-3.5},5.1773455377574331,null,"Ablesehilfen","Fadenkreuz im MNID",null,null,44,-6.5000000000000002E-2,0.01,-6.4997795980787657E-2,9.9149689529512367E-3,-1.5987414187643024E-3,-1.3596428409737533,-135.96428409737533,8.8376784663293968]
[null,3,-0.30000000000000004,-0.39312500000000011,-0.6937500000000002,null,null,null,null,null,47,-3.5,4.5766590389015978,null,"mue_Ed",{"$f":"C106","v":0.49019607843137253},2.2000000000000002,null,45,-5.5E-2,0.01,-5.4998144122881926E-2,9.9391461310196407E-3,-1.5550343249427921E-3,-1.3465436315907295,-134.65436315907297,7.4059899737490138]
[null,4,-0.4,-0.5099999999999999,-0.89999999999999969,null,{"$f":"$E$61","v":-3.5},0,null,null,48,-3.5,3.9759725400457624,null,"senkrecht",{"$f":"P67","v":0.49019607843137253},-3,null,46,-4.5000000000000005E-2,0.01,-4.4998487679049556E-2,9.959248938637302E-3,-1.5113272311212819E-3,-1.3320912859220608,-133.2091285922061,5.9944107866492748]
[null,5,-0.5,-0.61979166666666674,-1.09375,null,{"$f":"$E$61","v":-3.5},{"$f":"-G61","v":-1.4166666666666667},null,null,49,-3.5,3.375286041189927,null,"Skalierfaktor",1.06,null,null,47,-3.5000000000000003E-2,0.01,-3.4998827533261549E-2,9.9753020119372118E-3,-1.4676201372997716E-3,-1.3162858039677472,-131.62858039677474,4.6070003138871165]
[null,6,-0.6,-0.72250000000000003,-1.2749999999999999,null,{"$f":"$E$61","v":-3.5},{"$f":"-C61/10","v":-2.5},null,null,50,-3.5,2.7745995423340917,null,null,null,null,null,48,-2.5000000000000001E-2,0.01,-2.4999164538927077E-2,9.9873248815462532E-3,-1.4239130434782613E-3,-1.2991271857277886,-129.91271857277886,3.2478179643194718]
[null,7,-0.7,-0.81812499999999988,-1.4437499999999999,null,null,null,null,"Bereich 3-4",51,-3.5,{"$f":"H16*1000","v":2.1739130434782608},null,"nue_Ed",0,{"$f":"C105","v":-1.1764705882352942},null,49,-1.5000000000000001E-2,0.01,-1.4999499526196586E-2,9.9953320926070913E-3,-1.380205949656751E-3,-1.2806154312021849,-128.06154312021849,1.9209231468032775]
[null,8,-0.79999999999999993,-0.90666666666666662,-1.5999999999999999,null,null,null,null,{"$f":"M71/10","v":0.21739130434782608},52,-3.5,{"$f":"M71-$J$72","v":1.9565217391304346},null,"waagerecht",1.06,{"$f":"Q71","v":-1.1764705882352942},null,50,-5.0000000000000001E-3,0.01,-4.9998333088847003E-3,9.9993332933275766E-3,-1.3364988558352408E-3,-1.2607505403909363,-126.07505403909363,0.63037527019546813]
[null,9,-0.89999999999999991,-0.98812500000000003,-1.7437499999999999,null,"SD für sigm_yk",null,null,null,53,-3.5,1.7391304347826084,null,null,null,null,null,51,5.0000000000000001E-3,0.01,4.9998333088847003E-3,9.9993332933275766E-3,-1.2927917620137303E-3,-1.2395325132940427,-123.95325132940427,-0.61976625664702134]
[null,10,-0.99999999999999989,-1.0625,-1.875,null,"epss","sigms",null,null,54,-3.5,1.5217391304347823,null,null,null,null,null,52,1.5000000000000001E-2,0.01,1.4999499526196586E-2,9.9953320926070913E-3,-1.24908466819222E-3,-1.2169613499115042,-121.69613499115042,-1.8254420248672565]
[null,11,-1.0999999999999999,-1.1297916666666665,-1.9937499999999997,null,0,0,null,null,55,-3.5,1.3043478260869561,null,"Auswertung Stahlfasern",null,null,null,53,2.5000000000000001E-2,0.01,2.4999164538927077E-2,9.9873248815462532E-3,-1.2053775743707097E-3,-1.1930370502433207,-119.30370502433207,-2.982592625608302]
[null,12,-1.2,-1.19,-2.1,null,{"$f":"G16","v":2.5000000000000001E-3},{"$f":"C16","v":50},null,null,56,-3.5,1.0869565217391299,null,"Hilfslinien in SD-Verteilung",null,null,null,54,3.5000000000000003E-2,0.01,3.4998827533261549E-2,9.9753020119372118E-3,-1.1616704805491995E-3,-1.1677596142894922,-116.77596142894922,-4.0871586500132233]
[null,13,-1.3,-1.2431250000000003,-2.1937500000000001,null,{"$f":"H14","v":2.5000000000000001E-2},{"$f":"D16","v":52.5},null,null,57,-3.5,0.86956521739130388,null,"Faser 1",0,{"$f":"T7","v":-0.45},null,55,4.5000000000000005E-2,0.01,4.4998487679049556E-2,9.959248938637302E-3,-1.1179633867276892E-3,-1.1411290420500189,-114.1129042050019,-5.1350806892250862]
[null,14,-1.4000000000000001,-1.2891666666666668,-2.2749999999999999,null,null,null,null,null,58,-3.5,0.65217391304347783,null,null,{"$f":"IF(U7>0,X7,0)","v":-3.2814645308924485E-3},{"$f":"Q77","v":-0.45},null,56,5.5E-2,0.01,5.4998144122881926E-2,9.9391461310196407E-3,-1.0742562929061789E-3,-1.1131453335249004,-111.31453335249005,-6.1222993343869527]
[null,15,-1.5000000000000002,-1.328125,-2.34375,null,"SD für sigm_yd",null,null,null,59,-3.5,0.43478260869565177,null,"Faser 2",0,{"$f":"T8","v":-0.40500000000000003},null,57,6.5000000000000002E-2,0.01,6.4997795980787657E-2,9.9149689529512367E-3,-1.0305491990846686E-3,-1.0838084887141373,-108.38084887141372,-7.0447551766418917]
[null,16,-1.6000000000000003,-1.36,-2.4000000000000004,null,"epss","sigms",null,null,60,-3.5,0.21739130434782569,null,null,{"$f":"IF(U8>0,X8,0)","v":0},{"$f":"Q79","v":-0.40500000000000003},null,58,7.4999999999999997E-2,0.01,7.4997442330322836E-2,9.8866875095611328E-3,-9.8684210526315836E-4,-1.053118507617729,-105.3118507617729,-7.8983888071329673]
[null,17,-1.7000000000000004,-1.3847916666666669,-2.4437500000000001,null,0,0,null,"Bereich 4-4a",61,-3.5,0,null,"Faser 3",0,{"$f":"T9","v":-0.315},null,59,8.4999999999999992E-2,0.01,8.4997082202092497E-2,9.8542664585380638E-3,-9.4313501144164809E-4,-1.0210753902356757,-102.10753902356758,-8.679140817003244]
[null,18,-1.8000000000000005,-1.4025000000000003,-2.4750000000000005,null,{"$f":"H16","v":2.1739130434782609E-3},{"$f":"E16","v":43.478260869565219},null,{"$f":"M85/4","v":-4.3750000000000004E-2},62,-3.5,{"$f":"M81+$J$82","v":-4.3750000000000004E-2},null,null,{"$f":"IF(U9>0,X9,0)","v":0},{"$f":"Q81","v":-0.315},null,60,9.5000000000000001E-2,0.01,9.4996714570250468E-2,9.8176647831207716E-3,-8.9942791762013781E-4,-0.98767913656797746,-98.767913656797745,-9.3829517973957852]
[null,19,-1.9000000000000006,-1.4131250000000002,-2.4937499999999999,null,{"$f":"H14","v":2.5000000000000001E-2},{"$f":"F16","v":45.652173913043484},null,null,63,-3.5,{"$f":"M82+$J$82","v":-8.7500000000000008E-2},null,"Faser 4",0,{"$f":"T10","v":-0.22500000000000003},null,61,0.105,0.01,0.10499633834212467,9.7768355232840057E-3,-8.5572082379862754E-4,-0.95292974661463437,-95.292974661463447,-10.005762339453662]
[null,20,-2.0000000000000004,{"$f":"-$G$61","v":-1.4166666666666667},{"$f":"-$C$61/10","v":-2.5},null,null,null,null,null,64,-3.5,{"$f":"M83+$J$82","v":-0.13125000000000001},null,null,{"$f":"IF(U10>0,X10,0)","v":0},{"$f":"Q83","v":-0.22500000000000003},null,62,0.115,0.01,0.11499595234634795,9.7317254608662064E-3,-8.1201372997711716E-4,-0.91682722037564601,-91.682722037564588,-10.543513034319927]
[null,21,{"$f":"C84+($E$61-$D$61)/15","v":-2.1000000000000005},-1.4166666666666667,-2.5,null,"Hilfslinien für SD - Stahl",null,null,"Bereich 4a-5",65,-3.5,{"$f":"L85*Dateneingabe!G26","v":-0.17500000000000002},null,"Faser 5",0,{"$f":"T11","v":-0.13500000000000001},null,63,0.125,0.01,0.12499555531955697,9.6822747535019477E-3,-7.6830663615560688E-4,-0.87937155785101284,-87.937155785101297,-10.992144473137662]
[null,22,-2.2000000000000006,-1.4166666666666667,-2.5,null,"epss","sigms",null,{"$f":"(M100-M85)/15","v":-0.13326086956521738},66,{"$f":"($H$61-M86)*$J$87/($P$5-$J$87)+$H$61","v":-3.4115942028985509},{"$f":"M85+$J$86","v":-0.30826086956521737},null,null,{"$f":"IF(U11>0,X11,0)","v":0},{"$f":"Q85","v":-0.13500000000000001},null,64,0.13499999999999998,0.01,0.13499514589112097,9.6284165111835303E-3,-7.2459954233409672E-4,-0.84056275904073496,-84.056275904073502,-11.34759724704992]
[null,23,-2.3000000000000007,-1.4166666666666667,-2.5,null,{"$f":"H16","v":2.1739130434782609E-3},0,null,{"$f":"(E61-H61)/E61*100","v":37.88819875776398},67,-3.3231884057971017,-0.44152173913043474,null,"Faser 6",0,{"$f":"T12","v":-4.500000000000004E-2},null,65,0.14499999999999999,0.01,0.14499472256552753,9.5700763080383434E-3,-6.8089244851258634E-4,-0.80040082394481171,-80.040082394481175,-11.60581194719977]
[null,24,-2.4000000000000008,-1.4166666666666667,-2.5,null,{"$f":"H16","v":2.1739130434782609E-3},{"$f":"E16","v":43.478260869565219},null,null,68,-3.2347826086956522,-0.57478260869565212,null,null,{"$f":"IF(U12>0,X12,0)","v":0},{"$f":"Q87","v":-4.500000000000004E-2},null,66,0.155,0.01,0.15499428370196652,9.5071716204300563E-3,{"$f":"$T$3+$V$3*IF($J$6<5,T88,V88)","v":-6.3718535469107606E-4},-0.75888575256324375,{"$f":"Y88*IF($J$6<5,U88,W88)*10000","v":-75.888575256324373},{"$f":"Z88*IF($J$6<5,T88,V88)","v":-11.762729164730278}]
[null,25,-2.5000000000000009,-1.4166666666666667,-2.5,null,null,null,null,null,69,-3.146376811594203,-0.70804347826086955,null,"Faser 7",0,{"$f":"T13","v":4.4999999999999984E-2},null,67,0.16500000000000001,0.01,0.16499382749044678,9.4396111806995479E-3,-5.9347826086956568E-4,-0.71601754489603076,-71.601754489603081,-11.814289490784509]
[null,26,-2.600000000000001,-1.4166666666666667,-2.5,null,{"$f":"G16","v":2.5000000000000001E-3},0,null,null,70,-3.0579710144927539,-0.84130434782608687,null,null,{"$f":"IF(U13>0,X13,0)","v":0},{"$f":"Q89","v":4.4999999999999984E-2},null,68,0.17499999999999999,0.01,0.17499335192376356,9.367294233682438E-3,-5.4977116704805552E-4,-0.67179620094317283,-67.179620094317286,-11.756433516505524]
[null,27,-2.7000000000000011,-1.4166666666666667,-2.5,null,{"$f":"G16","v":2.5000000000000001E-3},{"$f":"C16","v":50},null,null,71,-2.9695652173913043,-0.97456521739130419,null,"Faser 8",0,{"$f":"T14","v":0.13499999999999995},null,69,0.185,0.01,0.18499285476421629,9.2901096804713038E-3,-5.0606407322654513E-4,{"$f":"SDBeton(X91,$D$23/1000,$G$23,$F$23)","v":-0.62622172070466986},-62.622172070466988,-11.585101833036392]
[null,28,-2.8000000000000012,-1.4166666666666667,-2.5,null,null,null,null,null,72,-2.8811594202898552,-1.1078260869565215,null,null,{"$f":"IF(U14>0,X14,0)","v":0},{"$f":"Q91","v":0.13499999999999995},null,70,0.19499999999999998,0.01,0.19499233350399633,9.2079350905851474E-3,-4.6235697940503497E-4,-0.5792941041805223,-57.929410418052228,-11.296235031520183]
[null,29,-2.9000000000000012,-1.4166666666666667,-2.5,null,{"$f":"H14","v":2.5000000000000001E-2},0,null,null,73,-2.792753623188406,-1.2410869565217388,null,"Faser 9",0,{"$f":"T15","v":0.22499999999999992},null,71,0.20500000000000002,0.01,0.20499178531775186,9.1206355596054802E-3,-4.1864988558352448E-4,-0.53101335137072925,-53.10133513707293,-10.885773703099952]
[null,30,-3.0000000000000013,-1.4166666666666667,-2.5,null,{"$f":"H14","v":2.5000000000000001E-2},{"$f":"F16","v":45.652173913043484},null,null,74,-2.7043478260869565,-1.3743478260869562,null,null,{"$f":"IF(U15>0,X15,0)","v":0},{"$f":"Q93","v":0.22499999999999992},null,72,0.215,0.01,0.21499120700514496,9.0280623841935657E-3,-3.7494279176201431E-4,-0.48137946227529138,-48.137946227529142,-10.349658438918766]
[null,31,-3.1000000000000014,-1.4166666666666667,-2.5,null,{"$f":"H14","v":2.5000000000000001E-2},{"$f":"D16","v":52.5},null,null,75,-2.6159420289855073,-1.5076086956521735,null,"Faser 10",0,{"$f":"T16","v":0.315},null,73,0.22500000000000001,0.01,0.22499059492116735,8.9300515198965508E-3,-3.3123569794050404E-4,-0.4303924368942087,-43.039243689420864,-9.683829830119695]
[null,32,-3.2000000000000015,-1.4166666666666667,-2.5,null,null,null,null,null,76,-2.5275362318840582,-1.6408695652173908,null,null,{"$f":"IF(U16>0,X16,0)","v":0},{"$f":"Q95","v":0.315},null,74,0.23499999999999999,0.01,0.2349899448907207,8.826421778876891E-3,-2.8752860411899376E-4,-0.37805227522748092,-37.805227522748098,-8.8842284678458032]
[null,33,-3.3000000000000016,-1.4166666666666667,-2.5,null,null,null,null,null,77,-2.439130434782609,-1.7741304347826081,null,"Faser 11",0,{"$f":"T17","v":0.40499999999999997},null,75,0.245,0.01,0.24498925210324327,8.7169727140682818E-3,-2.4382151029748349E-4,-0.32435897727510832,-32.435897727510834,-7.9467949432401541]
[null,34,-3.4000000000000017,-1.4166666666666667,-2.5,null,null,null,null,null,78,-2.3507246376811599,-1.9073913043478254,null,null,{"$f":"IF(U17>0,X17,0)","v":0},{"$f":"Q97","v":0.40499999999999997},null,76,0.255,0.01,0.25498851098166692,8.6014821224820529E-3,-2.00114416475973E-4,-0.26931254303709035,-26.931254303709036,-6.867469847445804]
[null,35,-3.5000000000000018,-1.4166666666666667,-2.5,null,null,null,null,null,79,-2.2623188405797103,-2.0406521739130428,null,"Faser 12",0,{"$f":"T18","v":0.45},null,77,0.26500000000000001,0.01,0.2649877150179068,8.4797030823732193E-3,-1.5640732265446273E-4,-0.21291297251342772,-21.291297251342773,-5.642193771605835]
[null,null,null,null,null,null,null,null,null,"Bereich -5",80,{"$f":"H61","v":-2.1739130434782608},{"$f":"L100","v":-2.1739130434782608},null,null,{"$f":"IF(U18>0,X18,0)","v":6.5217391304347744E-4},{"$f":"Q99","v":0.45},null,78,0.27500000000000002,0.01,0.27498685656474386,8.3513604151454028E-3,-1.1270022883295245E-4,-0.15516026570412003,-15.516026570412004,-4.2669073068633017]
[null,null,null,null,null,null,null,null,null,null,null,null,null,null,null,null,null,null,79,0.28500000000000003,0.01,0.28498592656954264,8.2161464310470458E-3,-6.8993135011442179E-5,-9.6054422609167495E-2,-9.6054422609167496,-2.7375510443612741]
[null,"Bezogene Bemessungsschnittgrößen",null,null,null,"Lösung aus Interpolation",null,null,null,"Neuberechnung erforderlich ?",null,null,null,null,"Interpolation der Dehnungen",null,null,null,80,0.29499999999999998,0.01,0.2949849142301878,8.0737157746437541E-3,-2.5286041189931906E-5,-3.5595443228570098E-2,-3.5595443228570103,-1.0500655752428181]
[null,"N_Ed =",{"$f":"Dateneingabe!G19","v":-4000},"[kN]",null,"zugeh. omega = ",{"$f":"O125","v":1.3643210707338145},"[1]",null,null,"ist","soll","ist-soll",null,"epsc2","epss1",null,null,81,0.30499999999999999,0.01,0.3049838065451505,7.9236791270566685E-3,1.8421052631578368E-5,0,0,0]
[null,"M_Ed =",{"$f":"Dateneingabe!I19","v":1000},"[kNm]",null,"zugeh. Dehnungszust. = ",{"$f":"P125","v":58.448410117265794},"[1]",null,"Teilsicherh.",1,{"$f":"B7","v":1},{"$f":"K104-L104","v":0},null,{"$f":"O105+($G$104-$G$105)/($G$106-$G$105)*(O106-O105)","v":-3.5},{"$f":"P105+($G$104-$G$105)/($G$106-$G$105)*(P106-P105)","v":0.55469345276830517},null,null,82,0.315,0.01,0.31498258771768606,7.7655954399719462E-3,6.2128146453088642E-5,0,0,0]
[null,"nue_Ed =",{"$f":"C103/O8/Datenbasis!G61","v":-1.1764705882352942},"[1]",null,"untere Grenze = ",{"$f":"ROUNDDOWN(G104,0)","v":58},"[1]",null,"C oder LC",1,{"$f":"B59","v":1},{"$f":"K105-L105","v":0},null,{"$f":"VLOOKUP(G105,$K$21:$M$100,2,FALSE)","v":-3.5},{"$f":"VLOOKUP(G105,$K$21:$M$100,3,FALSE)","v":0.65217391304347783},null,null,83,0.32500000000000001,0.01,0.32498123835567283,7.5989622607261723E-3,1.0583524027459892E-4,0,0,0]
[null,"mue_Ed =",{"$f":"C104/C107/K3/Datenbasis!G61*100","v":0.49019607843137253},"[1]",null,"obere Grenze = ",{"$f":"G105+1","v":59},"[1]",null,"epsc2",-2,{"$f":"D61","v":-2},0,null,{"$f":"IF(G106>80,L100,VLOOKUP(G106,$K$21:$M$100,2,FALSE))","v":-3.5},{"$f":"IF(G106>80,M100,VLOOKUP(G106,$K$21:$M$100,3,FALSE))","v":0.43478260869565177},null,null,84,0.33500000000000002,0.01,0.33497973438038886,7.4232035417031031E-3,1.4954233409610941E-4,0,0,0]
[null,"Ac =",{"$f":"O8","v":2400},"[cm2]",null,"ec2 =",{"$f":"O104","v":-3.5},"[0/00]",null,"epsc2u",-3.5,{"$f":"E61","v":-3.5},0,null,null,null,null,null,85,0.34499999999999997,0.01,0.34497804551268102,7.2376540844091867E-3,1.9324942791761946E-4,0,0,0]
[null,"Darstellung im Diagramm",null,null,null,"es2 =",{"$f":"G109+(G107-G109)*(P5-P4)/P5","v":-3.286595081433247},"[0/00]",null,"n",2,{"$f":"F61","v":2},0,null,{"$f":"ROUND(G104,0)","v":58},null,null,null,86,0.35500000000000004,0.01,0.3549761331322317,7.0415394059312082E-3,2.3695652173912995E-4,0,0,0]
[null,0,0,null,null,"es1 =",{"$f":"P104","v":0.55469345276830517},"[0/00]",null,"Querschnitt",1,{"$f":"J6","v":1},0,null,null,null,null,null,87,0.36499999999999999,0.01,0.36497394718459625,6.8339492612143476E-3,2.8066361556064001E-4,0,0,0]
[null,{"$f":"C106","v":0.49019607843137253},{"$f":"C105","v":-1.1764705882352942},null,null,"ec1 =",{"$f":"G109-(G107-G109)*P4/P5","v":0.76809837133505809},"[0/00]",null,"b0/b",0,{"$f":"M5","v":0},0,null,null,null,null,null,88,0.375,0.01,0.37497142160200791,6.6138021850213015E-3,3.2437070938215028E-4,0,0,0]
[null,null,null,null,null,null,null,null,null,"h0/h",0,{"$f":"K5","v":0},0,null,null,null,null,null,89,0.38500000000000001,0.01,0.38496846733217793,6.3797970120675037E-3,3.6807780320366077E-4,0,0,0]
[null,"Angrenzende mue-nue-Punkte",null,null,"ie =",1,"je =",1,null,"Stauchung",1,{"$f":"D3","v":1},0,null,null,null,null,null,90,0.39499999999999996,0.01,0.3949649613775294,6.1303449839805778E-3,4.1178489702517083E-4,0,0,0]
[null,"DZ \\ omega",1.2,null,1.3,null,1.4,null,null,"Verfestigung",2,{"$f":"C3","v":2},0,null,null,null,null,null,91,0.40500000000000003,0.01,0.40496072889950996,5.8634719649066549E-3,4.5549199084668132E-4,0,0,0]
[null,57,0.49165924605145761,-0.97746091988658557,0.52321326860784867,-1.0075809700118992,0.55476729116423973,-1.0377010201372123,null,"d1/h",0.05,{"$f":"Dateneingabe!$G$26","v":0.05},0,null,null,null,null,null,92,0.41499999999999998,0.01,0.41495551266296155,5.5766728441447458E-3,4.9919908466819138E-4,0,0,0]
[null,58,0.45983971372008353,-1.0697273466130996,0.48914430018624899,-1.1048486498712451,0.51844888665241429,-1.1399699531293903,null,"Nettobeton",0,{"$f":"G3","v":0},0,null,null,null,null,null,93,0.42499999999999999,0.01,0.42494891796911427,5.2666858813611604E-3,5.4290617848970187E-4,0,0,0]
[null,59,0.42625163573863001,-1.1655067778063077,0.45330678611457009,-1.2056293341972855,0.48036193649050979,-1.2457518905882625,null,"Folgerung:",{"$f":"IF(M116=0,\"Nein\",\"Ja\")","v":"Nein"},"Summe:",{"$f":"SUM(M104:M115)","v":0},null,null,null,null,null,94,0.435,0.01,0.43494030657813915,4.9291252886183093E-3,5.8661327231121214E-4,0,0,0]
[null,null,null,null,null,null,null,null,null,null,null,null,null,null,null,null,null,null,95,0.44500000000000001,0.01,0.44492857436495725,4.5578444998897686E-3,6.3032036613272242E-4,0,0,0]
[null,"Gleichungsystem (bilieare Interpolation)",null,null,null,null,"rechte Seite",null,null,"Kehrmatrix der Koeffizientenmatrix",null,null,null,null,"Lösungsvektoren",null,null,null,96,0.45500000000000002,0.01,0.45491163053910294,4.1437388586560327E-3,6.7402745995423291E-4,0,0,0]
[null,"Eckpunkt",1,"mue","nue","mue∙nue","omega","DZ",null,1,2,3,4,null,"für omega","für DZ",null,null,97,0.46499999999999997,0.01,0.46488497496898201,3.6722264558944808E-3,7.1773455377574296E-4,0,0,0]
[null,"1 = ol",1,{"$f":"IF(F112=0,IF(H112=0,C114,E114),IF(H112=0,C115,E115))","v":0.48914430018624899},{"$f":"IF(F112=0,IF(H112=0,D114,F114),IF(H112=0,D115,F115))","v":-1.1048486498712451},{"$f":"D120*E120","v":-0.54043041965299221},{"$f":"IF(H112=0,C113,E113)","v":1.3},{"$f":"IF(F112=0,B114,B115)","v":58},null,{"$f":"MINVERSE(C120:F123)","v":394.94697224520007},-376.83494462338217,354.25548594509445,-371.36751356691252,null,{"$f":"MMULT(J120:M123,G120:H123)","v":-0.41120276218202889},35.420541321702331,null,null,98,0.47499999999999998,0.01,0.47483679963055642,3.1169841027679909E-3,7.6144164759725302E-4,0,0,0]
[null,"2 = ul",1,{"$f":"IF(F112=0,IF(H112=0,C115,E115),IF(H112=0,C116,E116))","v":0.45330678611457009},{"$f":"IF(F112=0,IF(H112=0,D115,F115),IF(H112=0,D116,F116))","v":-1.2056293341972855},{"$f":"D121*E121","v":-0.54651995873042047},{"$f":"G120","v":1.3},{"$f":"IF(F112=0,B115,B116)","v":59},null,-795.31128574243473,779.8148646970343,-748.09114028096189,763.58756132636233,null,1.5496421045402258,31.723724416078767,null,null,99,0.48500000000000004,0.01,0.4847226655459122,2.4192011395264305E-3,8.0514874141876394E-4,0,0,0]
[null,"3 = ur",1,{"$f":"IF(F112=0,IF(H112=0,E115,G115),IF(H112=0,E116,G116))","v":0.48036193649050979},{"$f":"IF(F112=0,IF(H112=0,F115,H115),IF(H112=0,F116,H116))","v":-1.2457518905882625},-0.59841179054969151,{"$f":"IF(H112=0,E113,G113)","v":1.4},{"$f":"H121","v":59},null,333.36405771098754,-328.2928469163445,305.00183754265134,-310.07304833729444,null,-0.50712107946435481,-23.291009373697307,null,null,100,0.495,0.01,0.49400344850503036,1.3293261625554919E-3,8.48855835240274E-4,0,0,0]
[null,"4 = or",1,{"$f":"IF(F112=0,IF(H112=0,E114,G114),IF(H112=0,E115,G115))","v":0.51844888665241429},{"$f":"IF(F112=0,IF(H112=0,F114,H114),IF(H112=0,F115,H115))","v":-1.1399699531293903},-0.59101615301713728,{"$f":"G122","v":1.4},{"$f":"H120","v":58},null,-672.41188858396538,679.6822439370618,-645.1337435525619,637.86338819946548,null,-0.72703553530959653,34.548500384502404,null,null,null,{"$f":"SUM(T23:T122)","v":0},{"$f":"SUM(U23:U122)","v":1.0000000000000007},{"$f":"SUM(V23:V122)","v":5.5511151231257827E-16},{"$f":"SUM(W23:W122)","v":0.78539816339744828},null,null,{"$f":"SUM(Z23:Z122)","v":-9183.8491898008742},{"$f":"SUM(AA23:AA122)","v":1532.616245119736}]
[null,null,null,null,null,null,null,null,null,"Interpolation für Sollgrößen (mue_ED, nue_Ed)",null,null,null,null,"omega","DZ",null,null,"c2",-0.5,"Randdehnung oben",null,null,{"$f":"$L$17+T124*$M$17","v":-3.5000000000000001E-3},-1.4166666666666667]
[null,null,null,null,null,null,null,null,null,1,{"$f":"C106","v":0.49019607843137253},{"$f":"C105","v":-1.1764705882352942},{"$f":"K125*L125","v":-0.57670126874279126},null,{"$f":"MMULT(J125:M125,O120:P123)","v":1.3643210707338145},58.448410117265794,null,null,"c1",0.5,"Randdehnung unten",null,null,{"$f":"$L$17+T125*$M$17","v":8.7070938215102903E-4},0]
[]
[null,null,null,null,null,null,null,null,null,null,null,null,null,null,null,null,null,null,"Gesamtquerschnitt",null,null,null,null,null,null,"[kN]","[kNm]"]
[null,null,null,null,null,null,null,null,null,null,null,null,null,null,null,null,null,null,null,"z(i) [m]",null,null,null,null,null,"nb(i) + ns(i)","mb(i) + ms(i)"]
[null,null,null,null,null,null,null,null,null,null,null,null,null,null,null,null,null,null,null,{"$f":"AA129/Z129","v":-0.4427251644315735},null,null,null,null,null,{"$f":"Z123+Z19","v":-15652.02253984265},{"$f":"AA123+AA19","v":6929.5442526385323}]

{"sheet":"Speicherung","index":6,"n_rows":92,"n_cols":48,"rows_kept":92,"cut":false,"hidden":false,"merged":[[1,10,2,10],[3,10,4,10],[1,1,2,3],[1,7,2,8],[3,7,4,8]]}
[]
[null,"Alle Dehnungszustände und Bew-grade durchlaufen und Ergebnisse speichern",null,null,null,null,null,"Dehnungszustand auswählen",null,null,"Eintragen"]
[]
[null,null,null,null,null,null,null,"Bewehrungsgrad auswählen",null,null,"Löschen"]
[null,"omega",{"$f":"Datenbasis!P54","v":1.3},{"$f":"Datenbasis!O16","v":14},{"$f":"D5*2+1","v":29},0.02]
[]
[null,"n","muecd","nuecd",null,null,null,{"$f":"Dateneingabe!D2","v":""}]
[null,{"$f":"Datenbasis!K17","v":58},{"$f":"Datenbasis!$P$52","v":0.48914430018624899},{"$f":"Datenbasis!$P$53","v":-1.1048486498712451}]
[null,null,-0.1,"=extrapoliert",0,null,0.1,null,0.2,null,0.3,null,0.4,null,0.5,null,0.6,null,0.7,null,0.8,null,0.9,null,1,null,1.1000000000000001,null,1.2,null,1.3,null,1.4,null,1.5,null,1.6,null,1.7,null,1.8,null,1.9,null,2,null,2.5,"= extrapoliert"]
[null,"n",{"$f":"C7","v":"muecd"},{"$f":"D7","v":"nuecd"},{"$f":"C10","v":"muecd"},{"$f":"D10","v":"nuecd"},{"$f":"E10","v":"muecd"},{"$f":"F10","v":"nuecd"},{"$f":"G10","v":"muecd"},"nuecd","muecd","nuecd","muecd","nuecd","muecd","nuecd","muecd","nuecd","muecd","nuecd","muecd","nuecd","muecd","nuecd","muecd","nuecd","muecd","nuecd","muecd","nuecd","muecd","nuecd","muecd","nuecd","muecd","nuecd","muecd","nuecd","muecd","nuecd","muecd","nuecd","muecd","nuecd",{"$f":"AQ10","v":"muecd"},{"$f":"AR10","v":"nuecd"},{"$f":"AS10","v":"muecd"},{"$f":"AT10","v":"nuecd"}]
[null,0,{"$f":"-C13","v":0},{"$f":"D13","v":-0.25},{"$f":"-E13","v":0},{"$f":"F13","v":0},{"$f":"-G13","v":-5.8364661654135416E-4},{"$f":"H13","v":0.10370300751879696},{"$f":"-I13","v":-1.1672932330827083E-3},{"$f":"J13","v":0.20740601503759393},{"$f":"-K13","v":-1.7509398496240584E-3},{"$f":"L13","v":0.31110902255639072},{"$f":"-M13","v":-2.3345864661654166E-3},{"$f":"N13","v":0.41481203007518785},{"$f":"-O13","v":-2.9182330827067825E-3},{"$f":"P13","v":0.51851503759398454},{"$f":"-Q13","v":-3.5018796992481167E-3},{"$f":"R13","v":0.62221804511278145},{"$f":"-S13","v":-4.0855263157894674E-3},{"$f":"T13","v":0.72592105263157847},{"$f":"-U13","v":-4.6691729323308333E-3},{"$f":"V13","v":0.82962406015037571},{"$f":"-W13","v":-5.2528195488721679E-3},{"$f":"X13","v":0.93332706766917239},{"$f":"-Y13","v":-5.836466165413565E-3},{"$f":"Z13","v":1.0370300751879691},{"$f":"-AA13","v":-6.4201127819549005E-3},{"$f":"AB13","v":1.1407330827067663},{"$f":"-AC13","v":-7.0037593984962334E-3},{"$f":"AD13","v":1.2444360902255629},{"$f":"-AE13","v":-7.587406015037601E-3},{"$f":"AF13","v":1.3481390977443599},{"$f":"-AG13","v":-8.1710526315789348E-3},{"$f":"AH13","v":1.4518421052631569},{"$f":"-AI13","v":-8.7546992481202686E-3},{"$f":"AJ13","v":1.555545112781954},{"$f":"-AK13","v":-9.3383458646616666E-3},{"$f":"AL13","v":1.6592481203007514},{"$f":"-AM13","v":-9.9219924812030021E-3},{"$f":"AN13","v":1.7629511278195475},{"$f":"-AO13","v":-1.0505639097744336E-2},{"$f":"AP13","v":1.8666541353383448},{"$f":"-AQ13","v":-1.1089285714285732E-2},{"$f":"AR13","v":1.9703571428571416},{"$f":"-AS13","v":-1.167293233082713E-2},{"$f":"AT13","v":2.0740601503759382},{"$f":"-AU13","v":-1.4591165413533991E-2},{"$f":"AV13","v":2.5925751879699224}]
[null,1,{"$f":"E12/2","v":0},{"$f":"-0.25+F12/2","v":-0.25},0,0,0,0.10499999999999997,0,0.20999999999999994,0,0.31499999999999978,0,0.41999999999999987,0,0.52499999999999969,0,0.62999999999999956,0,0.73499999999999954,0,0.83999999999999975,0,0.94499999999999951,0,1.0499999999999994,0,1.1549999999999994,0,1.2599999999999991,0,1.3649999999999991,0,1.4699999999999991,0,1.5749999999999991,0,1.6799999999999995,0,1.7849999999999986,0,1.889999999999999,0,1.9949999999999986,0,2.0999999999999988,{"$f":"2*AS12-AI12","v":0},{"$f":"2*AT12-AJ12","v":2.6249999999999982}]
[null,2,{"$f":"E13/2","v":0},{"$f":"-0.25+F13/2","v":-0.25},0,0,5.8364661654135416E-4,0.10370300751879696,1.1672932330827083E-3,0.20740601503759393,1.7509398496240584E-3,0.31110902255639072,2.3345864661654166E-3,0.41481203007518785,2.9182330827067825E-3,0.51851503759398454,3.5018796992481167E-3,0.62221804511278145,4.0855263157894674E-3,0.72592105263157847,4.6691729323308333E-3,0.82962406015037571,5.2528195488721679E-3,0.93332706766917239,5.836466165413565E-3,1.0370300751879691,6.4201127819549005E-3,1.1407330827067663,7.0037593984962334E-3,1.2444360902255629,7.587406015037601E-3,1.3481390977443599,8.1710526315789348E-3,1.4518421052631569,8.7546992481202686E-3,1.555545112781954,9.3383458646616666E-3,1.6592481203007514,9.9219924812030021E-3,1.7629511278195475,1.0505639097744336E-2,1.8666541353383448,1.1089285714285732E-2,1.9703571428571416,1.167293233082713E-2,2.0740601503759382,{"$f":"2*AS13-AI13","v":1.4591165413533991E-2},{"$f":"2*AT13-AJ13","v":2.5925751879699224}]
[null,3,0,-0.25,0,0,1.0006578947368434E-2,8.2763157894736789E-2,2.0013157894736868E-2,0.16552631578947358,3.0019736842105283E-2,0.24828947368421023,4.0026315789473736E-2,0.33105263157894715,5.0032894736842151E-2,0.41381578947368375,6.0039473684210566E-2,0.49657894736842045,7.0046052631578995E-2,0.57934210526315733,8.0052631578947472E-2,0.66210526315789431,9.0059210526315867E-2,0.74486842105263085,0.1000657894736843,0.8276315789473675,0.11007236842105272,0.91039473684210459,0.12007894736842113,0.99315789473684091,0.13008552631578954,1.0759210526315779,0.14009210526315799,1.1586842105263147,0.15009868421052641,1.2414473684210514,0.16010526315789494,1.3242105263157886,0.17011184210526323,1.4069736842105249,0.18011842105263173,1.4897368421052617,0.19012500000000007,1.5724999999999985,0.2001315789473686,1.655263157894735,0.2501644736842108,2.0690789473684186]
[null,4,5.0700953471259755E-4,-0.25102426168628805,1.0140190694251951E-3,-2.0485233725761514E-3,1.4452440122056744E-2,7.3088318732687049E-2,2.7890861174688295E-2,0.14822516083795023,4.1329282227319832E-2,0.22336200294321332,5.4767703279951396E-2,0.29849884504847662,6.8206124332582913E-2,0.37363568715373963,8.1644545385214443E-2,0.44877252925900285,9.5082966437846E-2,0.52390937136426596,0.10852138749047759,0.59904621346952946,0.12195980854310912,0.67418305557479241,0.13539822959574066,0.74931989768005558,0.14883665064837218,0.82445673978531886,0.16227507170100366,0.89959358189058169,0.17571349275363529,0.97473042399584509,0.18915191380626678,1.0498672661011081,0.20259033485889835,1.1250041082063715,0.21602875591152995,1.2001409503116349,0.22946717696416138,1.2752777924168976,0.24290559801679301,1.350414634522161,0.2563440190694245,1.4255514766274238,0.2697824401220561,1.5006883187326872,0.33697454538521388,1.8763725292590028]
[null,5,1.9172877371883485E-3,-0.25390559729916895,3.834575474376697E-3,-7.8111945983378771E-3,2.0704838632271412E-2,5.9699331717451606E-2,3.7575101790166127E-2,0.12720985803324109,5.4445364948060834E-2,0.19472038434903047,7.1315628105955556E-2,0.26223091066482007,8.818589126385025E-2,0.32974143698060943,0.10505615442174496,0.39725196329639884,0.12192641757963968,0.46476248961218841,0.1387966807375344,0.53227301592797804,0.15566694389542912,0.59978354224376729,0.17253720705332382,0.66729406855955664,0.18940747021121856,0.73480459487534633,0.2062777333691132,0.80231512119113546,0.22314799652700798,0.86982564750692515,0.24001825968490267,0.93733617382271461,0.25688852284279734,1.004846700138504,0.27375878600069214,1.0723572264542938,0.29062904915858678,1.1398677527700829,0.30749931231648159,1.2073782790858725,0.32436957547437623,1.2748888054016618,0.34123983863227098,1.3423993317174512,0.42559115442174461,1.6799519632963984]
[null,6,4.0371485526315776E-3,-0.25830372541551244,8.0742971052631552E-3,-1.6607450831024929E-2,2.8376402368421063E-2,4.3276759695290809E-2,4.8678507631578972E-2,0.10316097022160653,6.8980612894736823E-2,0.16304518074792221,8.9282718157894791E-2,0.22292939127423803,0.10958482342105264,0.28281360180055365,0.12988692868421053,0.3426978123268693,0.15018903394736846,0.40258202285318512,0.17049113921052639,0.46246623337950094,0.19079324447368426,0.52235044390581653,0.21109534973684213,0.58223465443213229,0.23139745500000009,0.64211886495844805,0.25169956026315787,0.70200307548476359,0.27200166552631583,0.76188728601107958,0.29230377078947373,0.82177149653739523,0.31260587605263168,0.88165570706371088,0.33290798131578969,0.94153991759002675,0.35321008657894742,1.0014241281163421,0.37351219184210543,1.0613083386426581,0.39381429710526328,1.1211925491689738,0.41411640236842101,1.1810767596952894,0.51562692868421034,1.4804978123268677]
[null,7,6.5297790858725767E-3,-0.26355753462603876,1.3059558171745153E-2,-2.7115069252077559E-2,3.6793505540166214E-2,2.5142825484764503E-2,6.052745290858727E-2,7.7400720221606559E-2,8.4261400277008291E-2,0.12965861495844858,0.10799534764542938,0.18191650969529069,0.13172929501385039,0.23417440443213272,0.15546324238227144,0.28643229916897472,0.17919718975069251,0.33869019390581678,0.20293113711911362,0.39094808864265895,0.22666508448753467,0.44320598337950096,0.25039903185595563,0.4954638781163429,0.27413297922437674,0.54772177285318502,0.29786692659279762,0.59997966759002697,0.32160087396121878,0.65223756232686914,0.34533482132963983,0.70449545706371108,0.36906876869806093,0.75675335180055325,0.39280271606648204,0.80901124653739542,0.41653666343490292,0.86126914127423704,0.44027061080332414,0.91352703601107943,0.46400455817174502,0.96578493074792127,0.48773850554016607,1.0180428254847635,0.6064082423822712,1.2793322991689737]
[null,8,9.1951632184902824E-3,-0.26927723770775619,1.8390326436980565E-2,-3.8554475415512379E-2,4.5556115910664767E-2,6.0771035318560587E-3,7.2721905384348959E-2,5.0708682479224498E-2,9.9887694858033116E-2,9.5340261426592854E-2,0.12705348433171734,0.13997184037396138,0.15421927380540149,0.18460341932132973,0.18138506327908563,0.22923499826869811,0.20855085275276986,0.27386657721606655,0.23571664222645411,0.31849815616343508,0.2628824317001382,0.36312973511080349,0.29004822117382234,0.40776131405817179,0.31721401064750659,0.45239289300554036,0.34437980012119068,0.49702447195290861,0.37154558959487494,0.54165605090027713,0.39871137906855919,0.58628762984764549,0.42587716854224322,0.63091920879501406,0.45304295801592764,0.67555078774238264,0.48020874748961162,0.72018236668975077,0.50737453696329593,0.76481394563711935,0.53454032643698002,0.8094455245844876,0.56170611591066411,0.85407710353185606,0.69753506327908499,1.0772349982686982]
[null,9,1.184588741862881E-2,-0.27508921918282547,2.369177483725762E-2,-5.0178438365650987E-2,5.4289406416205006E-2,-1.3173175207756304E-2,8.488703799515239E-2,2.3832087950138383E-2,0.11548466957409968,6.0837351108033018E-2,0.14608230115304716,9.7842614265927746E-2,0.17667993273199448,0.13484787742382237,0.20727756431094183,0.17185314058171702,0.23787519588988923,0.2088584037396117,0.26847282746883666,0.24586366689750649,0.2990704590477839,0.28286893005540104,0.32966809062673125,0.31987419321329574,0.36026572220567865,0.35687945637119051,0.39086335378462594,0.39388471952908505,0.42146098536357335,0.43088998268697981,0.45205861694252075,0.46789524584487441,0.48265624852146805,0.50490050900276906,0.51325388010041573,0.54190577216066405,0.54385151167936274,0.57891103531855848,0.5744491432583102,0.61591629847645324,0.60504677483725766,0.65292156163434789,0.63564440641620501,0.68992682479224254,0.78863256431094197,0.87495314058171603]
[null,10,1.4364321546052628E-2,-0.28075238313711909,2.8728643092105256E-2,-6.1504766274238211E-2,6.2758116776315792E-2,-3.2125818905817193E-2,9.6787590460526318E-2,-2.7468715373961785E-3,0.13081706414473676,2.6632075831024806E-2,0.16484653782894737,5.6011023199445856E-2,0.19887601151315784,8.5389970567866791E-2,0.23290548519736831,0.11476891793628781,0.26693495888157892,0.14414786530470883,0.30096443256578947,0.17352681267312992,0.33499390625000003,0.20290576004155084,0.36902337993421047,0.23228470740997181,0.40305285361842103,0.26166365477839287,0.43708232730263136,0.29104260214681382,0.47111180098684213,0.32042154951523483,0.50514127467105252,0.34980049688365589,0.53917074835526302,0.37917944425207689,0.57320022203947374,0.40855839162049806,0.60722969572368402,0.43793733898891879,0.64125916940789474,0.46731628635733996,0.67528864309210512,0.4966952337257608,0.70931811677631562,0.5260741810941818,0.87946548519736822,0.67296891793628677]
[null,11,1.679878315096954E-2,-0.28637477146814405,3.359756630193908E-2,-7.2749542936288117E-2,7.105888209141277E-2,-5.0996911357340809E-2,0.10852019788088647,-2.9244279778393504E-2,0.14598151367036014,-7.4916481994462244E-3,0.18344282945983384,1.4260983379501106E-2,0.22090414524930749,3.6013614958448383E-2,0.25836546103878116,5.7766246537395663E-2,0.29582677682825492,7.9518878116342978E-2,0.33328809261772863,0.10127150969529033,0.37074940840720227,0.12302414127423757,0.40821072419667598,0.14477677285318488,0.44567203998614974,0.16652940443213221,0.48313335577562339,0.18828203601107946,0.52059467156509709,0.21003466759002679,0.55805598735457074,0.23178729916897406,0.59551730314404439,0.25353993074792136,0.63297861893351814,0.27529256232686877,0.67043993472299168,0.29704519390581591,0.70790125051246544,0.31879782548476326,0.7453625663019392,0.34055045706371045,0.78282388209141274,0.36230308864265787,0.97013046103878109,0.47106624653739437]
[null,12,1.9114895535405112E-2,-0.29186462058518003,3.8229791070810225E-2,-8.3729241170360055E-2,7.9122948965547071E-2,-6.9602925380886374E-2,0.12001610686028391,-5.5476609591412707E-2,0.16090926475502068,-4.135029380193906E-2,0.20180242264975756,-2.7223978012465348E-2,0.2426955805444943,-1.3097662222991708E-2,0.28358873843923116,1.0286535664819352E-3,0.32448189633396796,1.5154969355955644E-2,0.36537505422870492,2.928128514542935E-2,0.40626821212344166,4.3407600934902965E-2,0.44716137001817841,5.7533916724376639E-2,0.48805452791291548,7.1660232513850314E-2,0.52894768580765206,8.5786548303323926E-2,0.56984084370238897,9.9912864092797607E-2,0.61073400159712576,0.11403917988227133,0.65162715949186245,0.12816549567174501,0.69252031738659958,0.14229181146121875,0.73341347528133627,0.15641812725069218,0.77430663317607307,0.170544443040166,0.81519979107080964,0.18467075882963965,0.85609294896554655,0.19879707461911333,1.0605587384392305,0.26942865356648166]
[null,13,2.1309796874999981E-2,-0.29720312499999996,4.2619593749999962E-2,-9.4406249999999942E-2,8.6944593749999938E-2,-8.7906249999999922E-2,0.13126959374999991,-8.1406249999999916E-2,0.17559459374999983,-7.4906249999999924E-2,0.21991959374999986,-6.8406249999999905E-2,0.26424459374999981,-6.1906249999999899E-2,0.30856959374999982,-5.5406249999999921E-2,0.35289459374999971,-4.8906249999999922E-2,0.39721959374999993,-4.2406249999999882E-2,0.44154459374999983,-3.5906249999999904E-2,0.48586959374999966,-2.9406249999999867E-2,0.53019459374999978,-2.2906249999999899E-2,0.57451959374999961,-1.6406249999999924E-2,0.61884459374999967,-9.9062499999999498E-3,0.6631695937499994,-3.406249999999912E-3,0.70749459374999946,3.0937500000001263E-3,0.75181959374999974,9.5937500000001629E-3,0.79614459374999935,1.6093750000000073E-2,0.84046959374999963,2.259375000000011E-2,0.88479459374999936,2.9093750000000019E-2,0.92911959374999942,3.5593750000000188E-2,1.1507445937499994,6.8093750000000244E-2]
[null,14,2.1747979971799548E-2,-0.29829680984919027,4.3495959943599095E-2,-9.6593619698380581E-2,8.8118570746923169E-2,-9.0886555986469234E-2,0.13274118155024725,-8.5179492274557872E-2,0.17736379235357125,-7.947242856264651E-2,0.22198640315689544,-7.3765364850735149E-2,0.26660901396021941,-6.8058301138823774E-2,0.31123162476354344,-6.2351237426912426E-2,0.35585423556686757,-5.664417371500105E-2,0.40047684637019171,-5.0937110003089703E-2,0.44509945717351573,-4.52300462911783E-2,0.48972206797683976,-3.9522982579266952E-2,0.5343446787801639,-3.3815918867355604E-2,0.57896728958348775,-2.810885515544426E-2,0.62358990038681195,-2.240179144353285E-2,0.66821251119013603,-1.6694727731621509E-2,0.71283512199346011,-1.0987664019710162E-2,0.7574577327967843,-5.2806003077988176E-3,0.80208034360010805,4.2646340411252683E-4,0.84670295440343257,6.133527116024E-3,0.89132556520675632,1.1840590827935217E-2,0.93594817601008029,1.7547654539846688E-2,1.1590612300267005,4.608297309940354E-2]
[null,15,2.2164498994523916E-2,-0.29933714568063458,4.4328997989047832E-2,-9.8674291361269179E-2,8.9249219595695997E-2,-9.3760163937446447E-2,0.1341694412023442,-8.884603651362373E-2,0.17908966280899233,-8.3931909089801013E-2,0.22400988441564057,-7.9017781665978282E-2,0.26893010602228862,-7.4103654242155564E-2,0.31385032762893683,-6.9189526818332847E-2,0.35877054923558505,-6.4275399394510102E-2,0.40369077084223332,-5.9361271970687385E-2,0.44861099244888136,-5.4447144546864674E-2,0.49353121405552947,-4.9533017123041957E-2,0.53845143566217779,-4.461888969921924E-2,0.58337165726882567,-3.9704762275396523E-2,0.62829187887547389,-3.4790634851573805E-2,0.6732121004821221,-2.9876507427751026E-2,0.71813232208877043,-2.4962380003928374E-2,0.76305254369541864,-2.0048252580105595E-2,0.80797276530206674,-1.5134125156282943E-2,0.85289298690871507,-1.0219997732460163E-2,0.89781320851536284,-5.3058703086375112E-3,0.94273343012201105,-3.9174288481473146E-4,1.1673345381552518,2.4178894234298913E-2]
[null,16,2.2559353943173086E-2,-0.30032413249433282,4.5118707886346171E-2,-0.10064826498866564,9.0336540296318435E-2,-9.652707385293155E-2,0.13555437270629073,-9.2405882717197477E-2,0.18077220511626296,-8.8284691581463376E-2,0.22599003752623525,-8.4163500445729303E-2,0.27120786993620749,-8.0042309309995188E-2,0.31642570234617967,-7.5921118174261129E-2,0.36164353475615196,-7.1799927038527084E-2,0.40686136716612425,-6.7678735902792997E-2,0.45207919957609655,-6.355754476705891E-2,0.49729703198606878,-5.9436353631324761E-2,0.54251486439604113,-5.5315162495590729E-2,0.58773269680601326,-5.1193971359856642E-2,0.63295052921598549,-4.7072780224122493E-2,0.67816836162595784,-4.2951589088388531E-2,0.72338619403593007,-3.8830397952654319E-2,0.76860402644590253,-3.4709206816920357E-2,0.81382185885587455,-3.0588015681186145E-2,0.85903969126584712,-2.6466824545452187E-2,0.90425752367581913,-2.2345633409717972E-2,0.94947535608579159,-1.8224442273983885E-2,1.1755645181356531,2.3815134046865499E-3]
[null,17,2.3054526331161555E-2,-0.30158305432605703,4.6109052662323111E-2,-0.10316610865211408,9.162449587561948E-2,-9.9837853804468635E-2,0.13713993908891586,-9.6509598956823164E-2,0.18265538230221218,-9.3181344109177749E-2,0.22817082551550857,-8.9853089261532251E-2,0.27368626872880492,-8.6524834413886823E-2,0.31920171194210123,-8.3196579566241394E-2,0.3647171551553976,-7.9868324718595937E-2,0.41023259836869413,-7.6540069870950411E-2,0.45574804158199056,-7.3211815023304955E-2,0.5012634847952866,-6.9883560175659568E-2,0.54677892800858308,-6.6555305328014111E-2,0.59229437122187933,-6.322705048036871E-2,0.63780981443517581,-5.9898795632723323E-2,0.68332525764847207,-5.657054078507779E-2,0.72884070086176855,-5.3242285937432396E-2,0.77435614407506503,-4.9914031089786752E-2,0.81987158728836096,-4.6585776242141483E-2,0.86538703050165777,-4.3257521394495832E-2,0.91090247371495392,-3.9929266546850438E-2,0.95641791692825018,-3.6601011699205044E-2,1.1839951329947318,-1.9959737460977692E-2]
[null,18,2.3546736203890001E-2,-0.30283836487148519,4.7093472407780002E-2,-0.10567672974297038,9.2906526424400462E-2,-0.10314141118341361,0.13871958044102098,-0.10060609262385684,0.1845326344576414,-9.8070774064300092E-2,0.23034568847426196,-9.5535455504743294E-2,0.27615874249088235,-9.3000136945186523E-2,0.32197179650750279,-9.0464818385629794E-2,0.3677848505241233,-8.7929499826072968E-2,0.41359790454074385,-8.5394181266516198E-2,0.4594109585573643,-8.2858862706959427E-2,0.50522401257398464,-8.032354414740267E-2,0.55103706659060525,-7.7788225587845899E-2,0.59685012060722553,-7.5252907028289198E-2,0.64266317462384626,-7.2717588468732372E-2,0.68847622864046665,-7.0182269909175532E-2,0.73428928265708715,-6.7646951349618845E-2,0.78010233667370787,-6.5111632790062018E-2,0.82591539069032782,-6.2576314230505303E-2,0.87172844470694844,-6.0040995670948484E-2,0.91754149872356883,-5.7505677111391651E-2,0.96335455274018933,-5.497035855183495E-2,1.1924198228232914,-4.2293765754051055E-2]
[null,19,2.4012704938416132E-2,-0.30402758419309117,4.8025409876832265E-2,-0.10805516838618232,9.3973555899784358E-2,-0.10595163323250863,0.13992170192273645,-0.10384809807883499,0.18586984794568853,-0.10174456292516133,0.23181799396864064,-9.9641027771487645E-2,0.27776613999159272,-9.7537492617813984E-2,0.32371428601454466,-9.5433957464140365E-2,0.36966243203749699,-9.3330422310466649E-2,0.4156105780604491,-9.1226887156792974E-2,0.4615587240834011,-8.9123352003119313E-2,0.5075068701063532,-8.7019816849445653E-2,0.55345501612930514,-8.4916281695772006E-2,0.59940316215225731,-8.28127465420984E-2,0.64535130817520936,-8.0709211388424629E-2,0.69129945419816163,-7.8605676234750968E-2,0.73724760022111346,-7.6502141081077307E-2,0.78319574624406596,-7.4398605927403647E-2,0.82914389226701768,-7.2295070773729986E-2,0.87509203828997006,-7.0191535620056325E-2,0.92104018431292189,-6.8088000466382789E-2,0.96698833033587417,-6.5984465312709004E-2,1.1967290604506349,-5.54667895443407E-2]
[null,20,2.4538201156823612E-2,-0.30538566230434433,4.9076402313647224E-2,-0.11077132460868866,9.4996501245186576E-2,-0.10873704153257734,0.14091660017672594,-0.10670275845646601,0.18683669910826523,-0.10466847538035469,0.23275679803980465,-0.10263419230424334,0.2786768969713439,-0.10059990922813204,0.32459699590288327,-9.8565626152020719E-2,0.37051709483442263,-9.6531343075909382E-2,0.416437193765962,-9.449705999979803E-2,0.46235729269750142,-9.2462776923686693E-2,0.50827739162904062,-9.0428493847575425E-2,0.55419749056057999,-8.8394210771464088E-2,0.60011758949211924,-8.6359927695352806E-2,0.64603768842365861,-8.4325644619241399E-2,0.69195778735519808,-8.2291361543130104E-2,0.73787788628673734,-8.0257078467018836E-2,0.78379798521827704,-7.8222795390907429E-2,0.82971808414981607,-7.6188512314796022E-2,0.87563818308135555,-7.4154229238684741E-2,0.92155828201289491,-7.2119946162573459E-2,0.96747838094443406,-7.0085663086462191E-2,1.1970788756021307,-5.9914247705905546E-2]
[null,21,2.5100576694990537E-2,-0.30685054944052714,5.0201153389981074E-2,-0.11370109888105429,9.6093205230107684E-2,-0.11173606788250526,0.14198525707023427,-0.10977103688395627,0.18787730891036084,-0.10780600588540724,0.23376936075048746,-0.10584097488685827,0.27966141259061406,-0.10387594388830924,0.32555346443074062,-0.10191091288976024,0.3714455162708673,-9.9945881891211216E-2,0.41733756811099393,-9.7980850892662258E-2,0.46322961995112061,-9.601581989411323E-2,0.50912167179124712,-9.4050788895564189E-2,0.5550137236313738,-9.2085757897015161E-2,0.60090577547150026,-9.0120726898466202E-2,0.64679782731162694,-8.8155695899917175E-2,0.69268987915175351,-8.6190664901368161E-2,0.7385819309918803,-8.4225633902819258E-2,0.78447398283200687,-8.226060290427023E-2,0.83036603467213344,-8.0295571905721203E-2,0.87625808651226011,-7.8330540907172175E-2,0.92215013835238657,-7.6365509908623147E-2,0.96804219019251314,-7.4400478910074119E-2,1.1975024493931459,-6.4575323917328981E-2]
[null,22,2.5630128219241214E-2,-0.30823127756417196,5.1260256438482428E-2,-0.11646255512834387,9.7124261187196304E-2,-0.1145667762073572,0.14298826593591019,-0.11267099728637053,0.18885227068462393,-0.11077521836538386,0.23471627543333795,-0.10887943944439717,0.28058028018205167,-0.10698366052341048,0.32644428493076555,-0.10508788160242387,0.37230828967947949,-0.10319210268143715,0.41817229442819343,-0.10129632376045045,0.46403629917690725,-9.9400544839463797E-2,0.50990030392562102,-9.7504765918477079E-2,0.55576430867433491,-9.5608986997490431E-2,0.60162831342304868,-9.3713208076503851E-2,0.64749231817176267,-9.1817429155517077E-2,0.69335632292047644,-8.9921650234530442E-2,0.73922032766919032,-8.8025871313543655E-2,0.78508433241790443,-8.6130092392557006E-2,0.83094833716661798,-8.4234313471570357E-2,0.87681234191533208,-8.2338534550583709E-2,0.92267634666404574,-8.0442755629596949E-2,0.96854035141275951,-7.85469767086103E-2,1.1978603751563286,-6.9068082103676945E-2]
[null,23,2.6243509585071743E-2,-0.30985644908512694,5.2487019170143485E-2,-0.11971289817025386,9.8322976827444591E-2,-0.1178863713268295,0.14415893448474576,-0.11605984448340513,0.18999489214204679,-0.11423331763998079,0.23583084979934801,-0.11240679079655642,0.28166680745664907,-0.1105802639531321,0.3275027651139501,-0.10875373710970773,0.3733387227712513,-0.10692721026628335,0.4191746804285526,-0.10510068342285901,0.46501063808585358,-0.10327415657943469,0.51084659574315461,-0.10144762973601036,0.5566825534004558,-9.9621102892585897E-2,0.60251851105775689,-9.7794576049161627E-2,0.64835446871505809,-9.5968049205737233E-2,0.69419042637235917,-9.4141522362312838E-2,0.74002638402966026,-9.2314995518888582E-2,0.78586234168696167,-9.0488468675464173E-2,0.83169829934426243,-8.8661941832039765E-2,0.87753425700156373,-8.6835414988615509E-2,0.92337021465886493,-8.5008888145191114E-2,0.9692061723161659,-8.3182361301766858E-2,1.1983859606026717,-7.4049727084645134E-2]
[null,24,2.6860985463246636E-2,-0.31150145620507885,5.3721970926493272E-2,-0.12300291241015769,9.952988149238165E-2,-0.12124563764429565,0.14533779205827005,-0.11948836287843365,0.19114570262415836,-0.11773108811257162,0.23695361319004682,-0.11597381334670959,0.28276152375593511,-0.11421653858084754,0.32856943432182339,-0.11245926381498554,0.37437734488771185,-0.11070198904912351,0.42018525545360036,-0.10894471428326151,0.46599316601948865,-0.10718743951739942,0.51180107658537699,-0.10543016475153739,0.55760898715126539,-0.10367288998567539,0.60341689771715357,-0.10191561521981336,0.64922480828304208,-0.10015834045395122,0.69503271884893048,-9.8401065688089331E-2,0.74084062941481865,-9.6643790922227329E-2,0.78664853998070738,-9.48865161563653E-2,0.83245645054659567,-9.3129241390503159E-2,0.87826436111248418,-9.1371966624641157E-2,0.92407227167837247,-8.9614691858779127E-2,0.96988018224426054,-8.7857417092917126E-2,1.1989197350737024,-7.9071043263606922E-2]
[null,25,2.7483883123248082E-2,-0.31317316525705596,5.4967766246496165E-2,-0.12634633051411193,0.10074762972097182,-0.12465830782581223,0.14652749319544744,-0.12297028513751254,0.19230735666992305,-0.12128226244921286,0.23808722014439879,-0.11959423976091316,0.28386708361887431,-0.11790621707261349,0.32964694709334996,-0.1162181943843138,0.37542681056782556,-0.11453017169601409,0.42120667404230122,-0.11284214900771439,0.46698653751677699,-0.1111541263194147,0.51276640099125248,-0.10946610363111506,0.55854626446572808,-0.10777808094281537,0.60432612794020368,-0.10609005825451566,0.6501059914146794,-0.10440203556621604,0.69588585488915522,-0.10271401287791627,0.74166571836363082,-0.10102599018961662,0.78744558183810653,-9.9337967501316862E-2,0.83322544531258191,-9.7649944813017225E-2,0.87900530878705774,-9.5961922124717464E-2,0.92478517226153334,-9.4273899436417841E-2,0.97056503573600872,-9.258587674811819E-2,1.1994643531083866,-8.4145763306619756E-2]
[null,26,2.8186351935123394E-2,-0.31508600587198465,5.6372703870246788E-2,-0.13017201174396928,0.10212452025330969,-0.12855324113323191,0.14787633663637256,-0.12693447052249454,0.19362815301943542,-0.12531569991175717,0.23937996940249839,-0.12369692930101982,0.2851317857855612,-0.12207815869028245,0.33088360216862406,-0.12045938807954511,0.37663541855168692,-0.11884061746880765,0.42238723493474989,-0.11722184685807036,0.4681390513178128,-0.11560307624733296,0.51389086770087555,-0.11398430563659563,0.55964268408393869,-0.11236553502585825,0.60539450046700138,-0.11074676441512094,0.65114631685006463,-0.10912799380438341,0.69689813323312721,-0.10750922319364604,0.74264994961619024,-0.10589045258290877,0.78840176599925316,-0.10427168197217139,0.83415358238231574,-0.10265291136143402,0.87990539876537899,-0.10103414075069664,0.92565721514844179,-9.9415370139959366E-2,0.97140903153150449,-9.7796599529221998E-2,1.2001681134468187,-8.9702746475535222E-2]
[null,27,2.8859824562594141E-2,-0.3169268246789565,5.7719649125188281E-2,-0.133853649357913,0.10344341841683843,-0.13230413082473796,0.14916718770848861,-0.1307546122915629,0.1948909570001387,-0.12920509375838785,0.24061472629178893,-0.12765557522521284,0.28633849558343899,-0.12610605669203778,0.33206226487508905,-0.12455653815886271,0.37778603416673928,-0.12300701962568772,0.42350980345838951,-0.12145750109251266,0.46923357275003963,-0.11990798255933766,0.51495734204168975,-0.11835846402616258,0.56068111133333998,-0.11680894549298758,0.60640488062498998,-0.11525942695981245,0.65212864991664032,-0.11370990842663757,0.69785241920829044,-0.11216038989346243,0.74357618849994056,-0.11061087136028744,0.7892999577915909,-0.1090613528271123,0.83502372708324069,-0.10751183429393731,0.88074749637489114,-0.1059623157607623,0.92647126566654103,-0.10441279722758728,0.97219503495819115,-0.10286327869441216,1.2008138814164417,-9.5115686028536872E-2]
[null,28,2.9638096382653883E-2,-0.31909501086302688,5.9276192765307767E-2,-0.1381900217260538,0.1049719149655452,-0.1367097552704411,0.15066763716578263,-0.13522948881482838,0.19636335936601998,-0.13374922235921563,0.24205908156625747,-0.13226895590360294,0.28775480376649476,-0.13078868944799024,0.33345052596673214,-0.12930842299237749,0.37914624816696968,-0.1278281565367648,0.42484197036720711,-0.12634789008115205,0.47053769256744449,-0.12486762362553937,0.51623341476768181,-0.12338735716992667,0.56192913696791935,-0.12190709071431394,0.60762485916815656,-0.12042682425870116,0.65332058136839399,-0.11894655780308841,0.69901630356863143,-0.1174662913474758,0.74471202576886875,-0.11598602489186303,0.79040774796910651,-0.11450575843625029,0.83610347016934339,-0.11302549198063754,0.88179919236958115,-0.11154522552502491,0.92749491456981836,-0.11006495906941216,0.97319063677005557,-0.10858469261379954,1.2016692477712425,-0.10118336033573604]
[null,29,3.0393613563114704E-2,-0.3212128167445133,6.0787227126229408E-2,-0.14242563348902665,0.10645490223505406,-0.14101461911097626,0.15212257734387877,-0.13960360473292588,0.1977902524527034,-0.13819259035487547,0.24345792756152812,-0.13678157597682511,0.28912560267035275,-0.1353705615987747,0.33479327777917733,-0.13395954722072431,0.38046095288800202,-0.1325485328426739,0.42612862799682688,-0.13113751846462354,0.47179630310565135,-0.12972650408657316,0.51746397821447609,-0.12831548970852275,0.56313165332330084,-0.12690447533047236,0.60879932843212525,-0.12549346095242192,0.65446700354095,-0.12408244657437155,0.70013467864977463,-0.12267143219632118,0.74580235375859916,-0.12126041781827095,0.79147002886742412,-0.11984940344022044,0.83713770397624843,-0.11843838906217008,0.88280537908507339,-0.11702737468411971,0.92847305419389792,-0.1156163603060692,0.97414072930272266,-0.11420534592801883,1.2024791048468462,-0.10715027403776671]
[null,30,3.1234824551715088E-2,-0.32361280432144801,6.2469649103430176E-2,-0.14722560864289597,0.1081092771208421,-0.14588384634240792,0.15374890513825407,-0.14454208404191984,0.19938853315566593,-0.14320032174143177,0.24502816117307791,-0.14185855944094372,0.29066778919048974,-0.14051679714045562,0.33630741720790164,-0.13917503483996757,0.38194704522531364,-0.13783327253947952,0.42758667324272565,-0.13649151023899145,0.47322630126013754,-0.1351497479385034,0.51886592927754926,-0.1338079856380153,0.56450555729496132,-0.13246622333752722,0.61014518531237316,-0.13112446103703917,0.65578481332978511,-0.12978269873655104,0.70142444134719706,-0.12844093643606305,0.74706406936460878,-0.12709917413557495,0.79270369738202107,-0.12575741183508696,0.83834332539943246,-0.12441564953459883,0.88398295341684474,-0.12307388723411083,0.92962258143425658,-0.12173212493362272,0.9752622094516683,-0.12039036263313459,1.2034603495387279,-0.11368155113069423]
[null,31,3.2098926962371294E-2,-0.32610959021790481,6.4197853924742587E-2,-0.15221918043580959,0.10980943485074178,-0.15094667021288385,0.15542101577674095,-0.14967415998995814,0.20103259670274007,-0.14840164976703241,0.24664417762873936,-0.1471291395441067,0.29225575855473845,-0.14585662932118096,0.33786733948073761,-0.14458411909825522,0.38347892040673681,-0.14331160887532948,0.42909050133273613,-0.1420390986524038,0.47470208225873528,-0.14076658842947801,0.52031366318473438,-0.13949407820655232,0.56592524411073364,-0.13822156798362659,0.61153682503673257,-0.13694905776070085,0.65714840596273205,-0.13567654753777508,0.70275998688873098,-0.13440403731484937,0.74837156781473002,-0.13313152709192361,0.79398314874072962,-0.13185901686899801,0.83959472966672855,-0.13058650664607213,0.88520631059272792,-0.12931399642314639,0.93081789151872685,-0.12804148620022079,0.97642947244472611,-0.12676897597729506,1.2044873770747222,-0.12040642486266651]
[null,32,3.2987055278605425E-2,-0.32870677596887454,6.5974110557210849E-2,-0.15741355193774906,0.1115576443917973,-0.15621029379238566,0.15714117822638374,-0.15500703564702223,0.20272471206097012,-0.1538037775016588,0.2483082458955567,-0.15260051935629543,0.29389177973014297,-0.15139726121093197,0.33947531356472943,-0.15019400306556854,0.38505884739931584,-0.1489907449202052,0.43064238123390242,-0.14778748677484177,0.47622591506848877,-0.14658422862947837,0.52180944890307512,-0.14538097048411491,0.56739298273766181,-0.14417771233875157,0.61297651657224805,-0.14297445419338808,0.65856005040683452,-0.14177119604802474,0.70414358424142087,-0.14056793790266137,0.74972711807600734,-0.13936467975729799,0.79531065191059402,-0.13816142161193451,0.84089418574518016,-0.13695816346657103,0.88647771957976684,-0.13575490532120768,0.93206125341435309,-0.13455164717584431,0.97764478724893922,-0.1333483890304808,1.205562456421871,-0.1273320983036636]
[null,33,3.397305894893466E-2,-0.33165643314613225,6.7946117897869321E-2,-0.16331286629226446,0.11350160464104304,-0.16217886022446337,0.15905709138421675,-0.16104485415666228,0.20461257812739039,-0.15991084808886125,0.25016806487056414,-0.15877684202106013,0.29572355161373776,-0.15764283595325906,0.34127903835691142,-0.156508829885458,0.38683452510008515,-0.15537482381765691,0.43239001184325898,-0.15424081774985579,0.47794549858643259,-0.15310681168205473,0.52350098532960632,-0.15197280561425372,0.5690564720727801,-0.1508387995464526,0.61461195881595354,-0.14970479347865154,0.66016744555912743,-0.14857078741085042,0.70572293230230121,-0.14743678134304933,0.75127841904547477,-0.14630277527524835,0.79683390578864866,-0.14516876920744712,0.84238939253182199,-0.14403476313964614,0.88794487927499577,-0.14290075707184502,0.93350036601816933,-0.1417667510040439,0.97905585276134321,-0.14063274493624295,1.2068332864772118,-0.13496271459723755]
[null,34,3.4991412827202632E-2,-0.33475337534877708,6.9982825654405265E-2,-0.16950675069755419,0.11551026530616623,-0.16844199670731544,0.16103770495792719,-0.16737724271707666,0.20656514460968808,-0.1663124887268379,0.25209258426144909,-0.16524773473659915,0.29762002391321002,-0.16418298074636037,0.34314746356497094,-0.16311822675612161,0.38867490321673193,-0.16205347276588283,0.43420234286849291,-0.16098871877564411,0.47972978252025389,-0.1599239647854053,0.52525722217201476,-0.1588592107951666,0.57078466182377574,-0.15779445680492785,0.61631210147553661,-0.15672970281468906,0.6618395411272977,-0.15566494882445034,0.70736698077905868,-0.15460019483421147,0.75289442043081944,-0.15353544084397275,0.79842186008258054,-0.15247068685373402,0.84394929973434141,-0.1514059328634953,0.88947673938610228,-0.15034117887325643,0.93500417903786326,-0.14927642488301782,0.98053161868962413,-0.14821167089277898,1.2081688169484288,-0.14288790094158521]
[null,35,3.6058254213633782E-2,-0.33805996844558089,7.2116508427267564E-2,-0.17611993689116182,0.11761590098761578,-0.1751244349784854,0.163115293547964,-0.17412893306580896,0.20861468610831216,-0.17313343115313251,0.25411407866866037,-0.17213792924045609,0.29961347122900861,-0.17114242732777965,0.34511286378935674,-0.17014692541510321,0.39061225634970498,-0.16915142350242679,0.43611164891005333,-0.16815592158975037,0.48161104147040151,-0.1671604196770739,0.52711043403074964,-0.16616491776439749,0.57260982659109794,-0.16516941585172107,0.61810921915144579,-0.1641739139390446,0.66360861171179419,-0.16317841202636824,0.70910800427214238,-0.16218291011369176,0.75460739683249045,-0.1611874082010154,0.80010678939283886,-0.16019190628833893,0.84560618195318682,-0.15919640437566246,0.89110557451353534,-0.15820090246298599,0.93660496707388341,-0.15720540055030963,0.98210435963423159,-0.15620989863763315,1.2096013224359727,-0.15123238907425091]
[null,36,3.7186392757115119E-2,-0.34163474420853124,7.4372785514230239E-2,-0.18326948841706248,0.11984413098316572,-0.1823432385819484,0.16531547645210118,-0.18141698874683426,0.21078682192103662,-0.18049073891172018,0.25625816738997215,-0.17956448907660605,0.30172951285890753,-0.178638239241492,0.34720085832784298,-0.17771198940637792,0.39267220379677858,-0.17678573957126381,0.43814354926571414,-0.17585948973614965,0.48361489473464947,-0.17493323990103563,0.52908624020358486,-0.17400699006592152,0.57455758567252047,-0.17308074023080736,0.62002893114145563,-0.1721544903956933,0.66550027661039135,-0.17122824056057911,0.71097162207932685,-0.17030199072546512,0.75644296754826235,-0.16937574089035104,0.80191431301719784,-0.16844949105523682,0.84738565848613312,-0.16752324122012272,0.89285700395506873,-0.16659699138500875,0.938328349424004,-0.1656707415498945,0.98379969489293928,-0.16474449171478056,1.2111564222376163,-0.16011324253921008]
[null,37,3.8386981476994819E-2,-0.34553570687592494,7.6773962953989638E-2,-0.19107141375184986,0.12221726133151238,-0.19021441599429806,0.1676605597090351,-0.18935741823674629,0.21310385808655774,-0.18850042047919452,0.25854715646408055,-0.18764342272164275,0.3039904548416032,-0.18678642496409098,0.3494337532191259,-0.18592942720653924,0.39487705159664865,-0.18507242944898744,0.44032034997417147,-0.18421543169143567,0.48576364835169422,-0.18335843393388393,0.53120694672921676,-0.18250143617633208,0.57665024510673968,-0.18164443841878039,0.62209354348426227,-0.18078744066122862,0.66753684186178519,-0.17993044290367688,0.71298014023930767,-0.17907344514612503,0.75842343861683059,-0.17821644738857331,0.80386673699435329,-0.17735944963102146,0.84931003537187577,-0.17650245187346977,0.8947533337493988,-0.17564545411591803,0.94019663212692151,-0.17478845635836632,0.98563993050444398,-0.17393145860081435,1.2128564223920573,-0.16964646981305539]
[null,38,3.9664606489350718E-2,-0.34980719610675159,7.9329212978701436E-2,-0.19961439221350324,0.12474446426481144,-0.19882664653351381,0.17015971555092144,-0.19803890085352432,0.21557496683703134,-0.19725115517353486,0.26099021812314138,-0.19646340949354543,0.30640546940925134,-0.195675663813556,0.3518207206953613,-0.19488791813356648,0.3972359719814712,-0.19410017245357711,0.44265122326758138,-0.19331242677358765,0.48806647455369134,-0.19252468109359816,0.53348172583980125,-0.19173693541360878,0.57889697712591126,-0.19094918973361924,0.62431222841202116,-0.19016144405362978,0.66972747969813129,-0.18937369837364032,0.71514273098424119,-0.188585952693651,0.7605579822703511,-0.18779820701366151,0.80597323355646144,-0.18701046133367205,0.8513884848425709,-0.18622271565368259,0.89680373612868125,-0.18543496997369313,0.94221898741479126,-0.18464722429370378,0.98763423870090117,-0.18385947861371432,1.2147104951314511,-0.17992075021376713]
[null,39,4.1021523549671549E-2,-0.35448927393065632,8.2043047099343097E-2,-0.20897854786131267,0.12743025129404031,-0.20826005425888555,0.17281745548873759,-0.20754156065645843,0.21820465968343475,-0.20682306705403133,0.26359186387813205,-0.20610457345160418,0.30897906807282921,-0.20538607984917709,0.35436627226752648,-0.20466758624674997,0.39975347646222364,-0.20394909264432282,0.44514068065692097,-0.20323059904189572,0.49052788485161825,-0.20251210543946857,0.53591508904631535,-0.20179361183704148,0.58130229324101279,-0.20107511823461435,0.6266894974357099,-0.20035662463218726,0.67207670163040722,-0.19963813102976019,0.71746390582510444,-0.19891963742733298,0.76285111001980155,-0.19820114382490589,0.8082383142144991,-0.19748265022247877,0.85362551840919598,-0.19676415662005156,0.89901272260389342,-0.19604566301762449,0.94439992679859053,-0.1953271694151974,0.98978713099328774,-0.1946086758127703,1.2167231519667738,-0.19101620780063472]
[null,40,4.2454117558187586E-2,-0.35960729492302485,8.4908235116375172E-2,-0.21921458984604966,0.13026739221965966,-0.21856534832118485,0.17562654932294419,-0.21791610679632004,0.22098570642622861,-0.21726686527145525,0.2663448635295132,-0.21661762374659047,0.31170402063279762,-0.21596838222172565,0.35706317773608215,-0.21531914069686084,0.40242233483936657,-0.21466989917199605,0.44778149194265116,-0.21402065764713132,0.49314064904593558,-0.21337141612226646,0.53849980614921999,-0.21272217459740164,0.58385896325250475,-0.21207293307253686,0.62921812035578906,-0.21142369154767204,0.67457727745907359,-0.2107744500228072,0.71993643456235812,-0.2101252084979425,0.76529559166564254,-0.20947596697307769,0.81065474876892729,-0.20882672544821299,0.85601390587221149,-0.20817748392334801,0.90137306297549613,-0.2075282423984833,0.94673222007878055,-0.20687900087361849,0.99209137718206508,-0.20622975934875362,1.2188871626984876,-0.20298355172442956]
[null,41,4.3955469220983749E-2,-0.36517693602472839,8.7910938441967498E-2,-0.23035387204945681,0.1332420484538393,-0.22977388260215431,0.17857315846571106,-0.22919389315485186,0.22390426847758274,-0.22861390370754942,0.26923537848945456,-0.22803391426024694,0.31456648850132624,-0.22745392481294449,0.35989759851319791,-0.22687393536564202,0.4052287085250697,-0.22629394591833957,0.45055981853694166,-0.22571395647103706,0.49589092854881334,-0.22513396702373453,0.54122203856068496,-0.22455397757643214,0.5865531485725568,-0.22397398812912961,0.63188425858442843,-0.22339399868182722,0.67721536859630038,-0.22281400923452477,0.722546478608172,-0.22223401978722235,0.76787758862004374,-0.2216540303399199,0.81320869863191581,-0.22107404089261731,0.85853980864378721,-0.22049405144531486,0.90387091865565916,-0.21991406199801228,0.94920202866753089,-0.21933407255070994,0.99453313867940252,-0.21875408310340747,1.2211886887387613,-0.21585413586689503]
[null,42,4.5572824346654869E-2,-0.37148818056179267,9.1145648693309739E-2,-0.24297636112358539,0.13644871161376879,-0.24246562375384526,0.18175177453422781,-0.24195488638410506,0.22705483745468677,-0.24144414901436498,0.27235790037514584,-0.24093341164462478,0.31766096329560484,-0.24042267427488465,0.36296402621606377,-0.23991193690514456,0.40826708913652282,-0.23940119953540434,0.45357015205698192,-0.2388904621656642,0.49887321497744092,-0.23837972479592412,0.54417627789789991,-0.23786898742618395,0.58947934081835895,-0.23735825005644381,0.63478240373881789,-0.2368475126867037,0.68008546665927705,-0.23633677531696354,0.72538852957973599,-0.23582603794722332,0.7706915925001947,-0.23531530057748326,0.81599465542065397,-0.23480456320774304,0.86129771834111279,-0.23429382583800296,0.90660078126157206,-0.2337830884682629,0.951903844182031,-0.23327235109852268,0.99720690710248994,-0.23276161372878251,1.2237222217047852,-0.23020792688008176]
[null,43,4.7261624854455425E-2,-0.37842927766225387,9.452324970891085E-2,-0.25685855532450769,0.13979826553795713,-0.25641707003232989,0.18507328136700343,-0.25597558474015208,0.23034829719604963,-0.25553409944797428,0.27562331302509596,-0.25509261415579648,0.32089832885414216,-0.25465112886361863,0.36617334468318841,-0.25420964357144082,0.41144836051223477,-0.25376815827926302,0.45672337634128107,-0.25332667298708517,0.50199839217032738,-0.25288518769490742,0.54727340799937341,-0.25244370240272962,0.59254842382841988,-0.25200221711055182,0.63782343965746591,-0.25156073181837396,0.68309845548651249,-0.25111924652619616,0.72837347131555863,-0.2506777612340183,0.77364848714460477,-0.2502362759418405,0.81892350297365135,-0.2497947906496627,0.86419851880269716,-0.24935330535748487,0.90947353463174374,-0.24891182006530715,0.95474855046078988,-0.24847033477312921,1.000023566289836,-0.24802884948095152,1.2263986454350673,-0.24582142302006255]
[null,44,4.9040386402977976E-2,-0.3862272516667401,9.8080772805955951E-2,-0.27245450333348015,0.14332774154358949,-0.27208227011886466,0.18857471028122302,-0.27171003690424916,0.2338216790188565,-0.27133780368963367,0.2790686477564901,-0.27096557047501818,0.32431561649412355,-0.27059333726040269,0.36956258523175717,-0.27022110404578725,0.41480955396939068,-0.26984887083117176,0.4600565227070243,-0.26947663761655621,0.5053034914446578,-0.26910440440194072,0.55055046018229126,-0.26873217118732518,0.59579742891992471,-0.26835993797270968,0.64104439765755827,-0.2679877047580943,0.68629136639519173,-0.26761547154347876,0.7315383351328254,-0.26724323832886332,0.77678530387045885,-0.26687100511424788,0.82203227260809253,-0.26649877189963234,0.86727924134572587,-0.26612653868501673,0.91252621008335966,-0.2657543054704013,0.957773178820993,-0.26538207225578575,1.0030201475586265,-0.26500983904117026,1.229254991246794,-0.26314867296809263]
[null,45,5.0904186726535176E-2,-0.39507010899079187,0.10180837345307035,-0.29014021798158374,0.14702729509929116,-0.28983723684453055,0.19224621674551196,-0.28953425570747743,0.23746513839173275,-0.28923127457042436,0.2826840600379536,-0.28892829343337112,0.32790298168417426,-0.28862531229631794,0.37312190333039502,-0.28832233115926481,0.41834082497661584,-0.28801935002221163,0.46355974662283678,-0.2877163688851585,0.50877866826905749,-0.28741338774810532,0.55399758991527814,-0.28711040661105208,0.59921651156149924,-0.28680742547399901,0.64443543320771979,-0.28650444433694583,0.68965435485394055,-0.28620146319989265,0.73487327650016132,-0.28589848206283947,0.78009219814638209,-0.28559550092578639,0.82531111979260319,-0.28529251978873321,0.87053004143882362,-0.28498953865167992,0.91574896308504461,-0.28468655751462685,0.96096788473126538,-0.28438357637757378,1.0061868063774859,-0.28408059524052048,1.2322814146085896,-0.28256568955525457]
[null,46,5.2825128092489314E-2,-0.40509320777092667,0.10565025618497863,-0.31018641554185333,0.15084113073978669,-0.30995268648236252,0.19603200529459472,-0.30971895742287164,0.24122287984940272,-0.30948522836338077,0.28641375440421085,-0.30925149930388995,0.33160462895901888,-0.30901777024439914,0.37679550351382679,-0.30878404118490826,0.42198637806863504,-0.30855031212541745,0.46717725262344312,-0.30831658306592663,0.51236812717825109,-0.30808285400643576,0.55755900173305906,-0.30784912494694494,0.60274987628786714,-0.30761539588745407,0.64794075084267488,-0.30738166682796325,0.69313162539748319,-0.30714793776847243,0.73832249995229127,-0.30691420870898162,0.78351337450709924,-0.30668047964949069,0.82870424906190743,-0.30644675058999987,0.8738951236167154,-0.30621302153050906,0.91908599817152359,-0.30597929247101824,0.96427687272633134,-0.30574556341152742,1.0094677472811393,-0.3055118343520366,1.2354221200551794,-0.30434318905458252]
[null,47,5.4780181403614188E-2,-0.41664389951063141,0.10956036280722838,-0.33328779902126288,0.1547231902706237,-0.33312332203933437,0.19988601773401907,-0.33295884505740586,0.24504884519741424,-0.33279436807547741,0.29021167266080966,-0.33262989109354879,0.33537450012420483,-0.33246541411162034,0.38053732758760017,-0.33230093712969189,0.42570015505099545,-0.33213646014776332,0.47086298251439085,-0.33197198316583482,0.51602580997778602,-0.33180750618390636,0.56118863744118119,-0.3316430292019778,0.6063514649045767,-0.33147855222004935,0.65151429236797187,-0.3313140752381209,0.69667711983136738,-0.33114959825619239,0.74183994729476233,-0.33098512127426377,0.78700277475815783,-0.33082064429233538,0.83216560222155356,-0.33065616731040681,0.8773284296849484,-0.33049169032847842,0.9224912571483439,-0.3303272133465498,0.96765408461173907,-0.33016273636462129,1.0128169120751342,-0.32999825938269267,1.2386310493921107,-0.32917587447304997]
[null,48,5.6702252468526532E-2,-0.42999303406831313,0.11340450493705306,-0.35998606813662631,0.15853928530903563,-0.35989084323226017,0.20367406568101817,-0.35979561832789392,0.24880884605300072,-0.35970039342352778,0.29394362642498334,-0.35960516851916158,0.33907840679696583,-0.35950994361479538,0.38421318716894842,-0.35941471871042924,0.42934796754093096,-0.35931949380606304,0.47448274791291356,-0.3592242689016969,0.51961752828489616,-0.35912904399733059,0.56475230865687853,-0.3590338190929645,0.60988708902886124,-0.3589385941885983,0.65502186940084373,-0.35884336928423216,0.70015664977282643,-0.35874814437986602,0.74529143014480892,-0.35865291947549977,0.79042621051679129,-0.35855769457113362,0.83556099088877411,-0.35846246966676742,0.88069577126075638,-0.35836724476240128,0.9258305516327392,-0.35827201985803497,0.97096533200472168,-0.35817679495366889,1.0161001123767042,-0.35808157004930274,1.2417740142366172,-0.35760544552747187]
[null,49,5.8493969983245374E-2,-0.44574064971395005,0.11698793996649075,-0.39148129942790011,0.16209467324706056,-0.39145532660109628,0.20720140652763039,-0.39142935377429239,0.25230813980820016,-0.39140338094748861,0.29741487308877007,-0.39137740812068478,0.34252160636933976,-0.39135143529388089,0.38762833964990956,-0.391325462467077,0.43273507293047941,-0.39129948964027322,0.47784180621104932,-0.39127351681346939,0.52294853949161924,-0.3912475439866655,0.5680552727721887,-0.39122157115986161,0.61316200605275883,-0.39119559833305778,0.65826873933332841,-0.39116962550625389,0.70337547261389832,-0.39114365267945012,0.74848220589446823,-0.39111767985264634,0.79358893917503781,-0.39109170702584239,0.83869567245560805,-0.39106573419903862,0.88380240573617752,-0.39103976137223467,0.92890913901674754,-0.3910137885454309,0.97401587229731734,-0.39098781571862695,1.0191226055778868,-0.39096184289182312,1.2446562719807357,-0.39083197875780384]
[null,50,5.996294599811694E-2,-0.46450278426395114,0.11992589199623388,-0.42900556852790228,0.16500457818539097,-0.42904884777866081,0.21008326437454811,-0.42909212702941929,0.25516195056370511,-0.42913540628017777,0.30024063675286222,-0.4291786855309363,0.34531932294201922,-0.42922196478169478,0.39039800913117623,-0.4292652440324532,0.43547669532033345,-0.42930852328321167,0.48055538150949062,-0.42935180253397026,0.52563406769864751,-0.42939508178472868,0.57071275388780451,-0.4294383610354871,0.61579144007696185,-0.42948164028624558,0.66087012626611874,-0.42952491953700406,0.70594881245527574,-0.42956819878776248,0.75102749864443286,-0.42961147803852096,0.79610618483358997,-0.42965475728927938,0.84118487102274719,-0.42969803654003813,0.88626355721190397,-0.42974131579079655,0.93134224340106142,-0.42978459504155503,0.97642092959021842,-0.42982787429231345,1.0214996157793754,-0.42987115354307176,1.2468930467251609,-0.43008754979686414]
[null,51,6.077749635215661E-2,-0.48718550926459248,0.12155499270431322,-0.47437101852918501,0.16660563180205759,-0.47448354985750579,0.21165627089980188,-0.47459608118582663,0.25670690999754614,-0.47470861251414742,0.30175754909529062,-0.47482114384246821,0.34680818819303477,-0.47493367517078899,0.39185882729077914,-0.47504620649910984,0.43690946638852346,-0.47515873782743062,0.48196010548626794,-0.47527126915575135,0.5270107445840122,-0.47538380048407225,0.57206138368175641,-0.47549633181239309,0.61711202277950095,-0.47560886314071382,0.66216266187724504,-0.47572139446903461,0.70721330097498936,-0.47583392579735545,0.75226394007273378,-0.47594645712567618,0.79731457917047788,-0.47605898845399702,0.84236521826822275,-0.4761715197823177,0.88741585736596684,-0.47628405111063865,0.93246649646371127,-0.47639658243895944,0.97751713556145547,-0.47650911376728017,1.0225677746591995,-0.47662164509560107,1.247820970147921,-0.47718430173720511]
[null,52,6.0801415935390651E-2,-0.49665818805997286,0.1216028318707813,-0.49331637611994572,0.16440403487830008,-0.49843016058109857,0.20720523788581888,-0.50354394504225153,0.25000644089333762,-0.50865772950340438,0.29280764390085645,-0.51377151396455722,0.33560884690837506,-0.51888529842571018,0.37841004991589394,-0.52399908288686303,0.42121125292341266,-0.52911286734801599,0.46401245593093154,-0.53422665180916873,0.50681365893845021,-0.53934043627032169,0.54961486194596887,-0.54445422073147454,0.59241606495348775,-0.5495680051926275,0.6352172679610063,-0.55468178965378023,0.6780184709685253,-0.55979557411493319,0.72081967397604407,-0.56490935857608615,0.76362087698356274,-0.570023143037239,0.80642207999108184,-0.57513692749839185,0.84922328299860028,-0.58025071195954481,0.89202448600611917,-0.58536449642069766,0.93482568901363783,-0.59047828088185061,0.9776268920211566,-0.59559206534300324,1.1916329070587506,-0.62116098764876748]
[null,53,6.0626405120071808E-2,-0.50686279677591628,0.12125281024014362,-0.51372559355183267,0.16180457715743682,-0.52384063114581769,0.20235634407473005,-0.53395566873980249,0.24290811099202322,-0.54407070633378751,0.28345987790931643,-0.55418574392777253,0.32401164482660966,-0.56430078152175744,0.36456341174390283,-0.57441581911574247,0.40511517866119606,-0.58453085670972738,0.44566694557848935,-0.59464589430371217,0.48621871249578258,-0.60476093189769731,0.52677047941307564,-0.61487596949168233,0.56732224633036898,-0.62499100708566724,0.60787401324766199,-0.63510604467965215,0.64842578016495533,-0.64522108227363717,0.68897754708224845,-0.65533611986762208,0.7295293139995418,-0.6654511574616071,0.77008108091683503,-0.67556619505559201,0.81063284783412792,-0.68568123264957692,0.85118461475142149,-0.69579627024356183,0.89173638166871461,-0.70591130783754708,0.93228814858600773,-0.71602634543153187,1.1350469831724737,-0.76660153340145665]
[null,54,6.0184871362302224E-2,-0.51800650619341337,0.12036974272460445,-0.53601301238682664,0.15867207355167207,-0.55112930311364383,0.19697440437873973,-0.56624559384046069,0.23527673520580733,-0.58136188456727789,0.27357906603287502,-0.59647817529409486,0.31188139685994259,-0.61159446602091183,0.35018372768701023,-0.6267107567477288,0.38848605851407791,-0.641827047474546,0.4267883893411456,-0.65694333820136297,0.46509072016821312,-0.67205962892818005,0.50339305099528076,-0.68717591965499714,0.54169538182234855,-0.70229221038181411,0.57999771264941613,-0.71740850110863119,0.6183000434764836,-0.73252479183544816,0.65660237430355128,-0.74764108256226525,0.69490470513061897,-0.76275737328908233,0.73320703595768677,-0.77787366401589952,0.77150936678475435,-0.7929899547427165,0.80981169761182203,-0.80810624546953336,0.84811402843888961,-0.82322253619635055,0.88641635926595741,-0.83833882692316752,1.0779280134012958,-0.91392028055725272]
[null,55,5.9417041578165103E-2,-0.53013316888146744,0.11883408315633021,-0.560266337762935,0.15488697789317227,-0.58038388162258403,0.19093987263001438,-0.60050142548223318,0.22699276736685642,-0.62061896934188221,0.26304566210369856,-0.64073651320153158,0.29909855684054049,-0.66085405706118061,0.33515145157738258,-0.68097160092082976,0.37120434631422466,-0.70108914478047879,0.40725724105106681,-0.72120668864012782,0.4433101357879089,-0.74132423249977719,0.47936303052475088,-0.76144177635942611,0.51541592526159308,-0.78155932021907537,0.551468819998435,-0.8016768640787244,0.58752171473527715,-0.82179440793837377,0.62357460947211918,-0.84191195179802281,0.65962750420896121,-0.86202949565767173,0.69568039894580347,-0.88214703951732099,0.73173329368264539,-0.90226458337697013,0.76778618841948765,-0.92238212723661928,0.80383908315632968,-0.94249967109626842,0.83989197789317172,-0.96261721495591757,1.0201564515773822,-1.0632049342541634]
[null,56,5.8235179736878057E-2,-0.54338572868829482,0.11647035947375611,-0.58677145737658953,0.1502738181203726,-0.61189025436907074,0.18407727676698915,-0.63700905136155195,0.21788073541360561,-0.66212784835403315,0.25168419406022219,-0.68724664534651436,0.28548765270683862,-0.71236544233899557,0.31929111135345506,-0.73748423933147667,0.35309457000007166,-0.76260303632395798,0.38689802864668832,-0.7877218333164393,0.4207014872933047,-0.8128406303089204,0.45450494593992119,-0.83795942730140149,0.48830840458653785,-0.86307822429388281,0.52211186323315417,-0.88819702128636391,0.55591532187977077,-0.91331581827884512,0.58971878052638727,-0.93843461527132632,0.62352223917300376,-0.96355341226380753,0.65732569781962047,-0.98867220925628885,0.69112915646623663,-1.0137910062487698,0.72493261511285345,-1.0389098032412512,0.75873607375946972,-1.0640286002337325,0.79253953240608632,-1.0891473972262136,0.96155682563916889,-1.2147413821886195]
[null,57,5.6505487687383109E-2,-0.55801015919141317,0.11301097537476622,-0.61602031838282634,0.14456499793115718,-0.64614036850813961,0.17611902048754816,-0.67626041863345299,0.20767304304393908,-0.70638046875876614,0.23922706560033005,-0.73650051888407941,0.27078108815672097,-0.76662056900939279,0.30233511071311192,-0.79674061913470595,0.33388913326950292,-0.82686066926001922,0.36544315582589382,-0.85698071938533271,0.39699717838228477,-0.88710076951064598,0.42855120093867577,-0.91722081963595925,0.46010522349506672,-0.94734086976127252,0.49165924605145761,-0.97746091988658557,0.52321326860784867,-1.0075809700118992,0.55476729116423973,-1.0377010201372123,0.58632131372063057,-1.0678210702625255,0.6178753362770214,-1.0979411203878391,0.64942935883341235,-1.128061170513152,0.68098338138980341,-1.1581812206384654,0.71253740394619436,-1.1883012707637786,0.74409142650258531,-1.2184213208890917,0.90186153928454005,-1.369021571515658]
[null,58,5.4092338063049472E-2,-0.57413585375767773,0.10818467612609894,-0.64827170751535534,0.13748926259226432,-0.68339301077350079,0.16679384905842973,-0.71851431403164601,0.1960984355245951,-0.75363561728979145,0.22540302199076048,-0.78875692054793689,0.2547076084569258,-0.823878223806082,0.28401219492309127,-0.85899952706422733,0.31331678138925662,-0.89412083032237277,0.34262136785542208,-0.92924213358051833,0.37192595432158743,-0.96436343683866343,0.40123054078775278,-0.99948474009680877,0.43053512725391818,-1.0346060433549544,0.45983971372008353,-1.0697273466130996,0.48914430018624899,-1.1048486498712451,0.51844888665241429,-1.1399699531293903,0.54775347311857969,-1.1750912563875358,0.5770580595847451,-1.2102125596456812,0.6063626460509105,-1.2453338629038266,0.63566723251707591,-1.2804551661619719,0.66497181898324131,-1.3155764694201171,0.69427640544940661,-1.3506977726782623,0.84079933778023352,-1.5263042889689888]
[null,59,5.0794915613676134E-2,-0.5920180505572894,0.10158983122735227,-0.68403610111457869,0.1286449816032921,-0.72415865750555608,0.15570013197923194,-0.76428121389653347,0.18275528235517166,-0.80440377028751098,0.20981043273111161,-0.84452632667848848,0.23686558310705136,-0.88464888306946576,0.26392073348299117,-0.92477143946044327,0.29097588385893103,-0.96489399585142055,0.31803103423487095,-1.0050165522423979,0.3450861846108107,-1.0451391086333757,0.37214133498675045,-1.085261665024353,0.39919648536269042,-1.1253842214153302,0.42625163573863001,-1.1655067778063077,0.45330678611457009,-1.2056293341972855,0.48036193649050979,-1.2457518905882625,0.50741708686644948,-1.2858744469792398,0.53447223724238957,-1.3259970033702178,0.56152738761832921,-1.366119559761195,0.58858253799426896,-1.4062421161521725,0.61563768837020894,-1.4463646725431498,0.64269283874614869,-1.4864872289341271,0.77796859062584789,-1.6871000108890144]
[null,60,4.6321792090028319E-2,-0.6120258801984878,9.2643584180056637E-2,-0.72405176039697561,0.11744929846577092,-0.76917556992078506,0.14225501275148519,-0.81429937944459474,0.16706072703719943,-0.85942318896840408,0.19186644132291375,-0.90454699849221365,0.21667215560862793,-0.94967080801602322,0.2414778698943422,-0.99479461753983245,0.26628358418005649,-1.0399184270636421,0.29108929846577092,-1.0850422365874517,0.31589501275148507,-1.130166046111261,0.34070072703719928,-1.1752898556350706,0.36550644132291349,-1.2204136651588802,0.39031215560862781,-1.2655374746826895,0.41511786989434213,-1.3106612842064991,0.43992358418005639,-1.3557850937303089,0.4647292984657706,-1.400908903254118,0.48953501275148509,-1.4460327127779278,0.51434072703719913,-1.4911565223017369,0.53914644132291356,-1.5362803318255467,0.56395215560862766,-1.581404141349356,0.58875786989434187,-1.6265279508731658,0.71278644132291313,-1.8521469984922136]
[null,61,4.0304834487534559E-2,-0.63453145775623254,8.0609668975069118E-2,-0.76906291551246508,0.10316594717055784,-0.81918797816910671,0.12572222536604655,-0.86931304082574834,0.14827850356153524,-0.91943810348238975,0.17083478175702399,-0.96956316613903148,0.19339105995251263,-1.0196882287956728,0.21594733814800132,-1.0698132914523146,0.23850361634349007,-1.1199383541089563,0.26105989453897888,-1.1700634167655979,0.28361617273446754,-1.2201884794222393,0.30617245092995615,-1.2703135420788809,0.32872872912544493,-1.3204386047355225,0.35128500732093348,-1.370563667392164,0.37384128551642232,-1.4206887300488056,0.39639756371191098,-1.470813792705447,0.4189538419073997,-1.5209388553620888,0.44151012010288848,-1.5710639180187305,0.46406639829837704,-1.6211889806753716,0.48662267649386587,-1.6713140433320135,0.50917895468935459,-1.7214391059886551,0.53173523288484326,-1.7715641686452963,0.64451662386228681,-2.0221894819285038]
[null,62,3.8869024802218995E-2,-0.63939504980874495,7.7738049604437989E-2,-0.77879009961748991,9.9841628786768777E-2,-0.82992166446711402,0.12194520796909962,-0.88105322931673791,0.14404878715143038,-0.93218479416636202,0.16615236633376124,-0.98331635901598613,0.18825594551609201,-1.0344479238656099,0.21035952469842278,-1.0855794887152341,0.23246310388075364,-1.1367110535648581,0.2545666830630845,-1.1878426184144824,0.27667026224541524,-1.2389741832641061,0.29877384142774605,-1.2901057481137301,0.3208774206100769,-1.3412373129633544,0.34298099979240759,-1.3923688778129779,0.36508457897473851,-1.4435004426626026,0.38718815815706925,-1.4946320075122261,0.40929173733940005,-1.5457635723618504,0.43139531652173108,-1.5968951372114746,0.45349889570406171,-1.6480267020610984,0.47560247488639257,-1.6991582669107226,0.49770605406872331,-1.7502898317603466,0.51980963325105412,-1.8014213966099701,0.63032752916270818,-2.0570792208580899]
[null,63,3.7350358953671454E-2,-0.6443737758883743,7.4700717907342909E-2,-0.7887475517767486,9.6351598076515846E-2,-0.84088561881935497,0.11800247824568877,-0.89302368586196157,0.13965335841486168,-0.94516175290456794,0.16130423858403461,-0.99729981994717454,0.18295511875320752,-1.0494378869897809,0.20460599892238043,-1.1015759540323873,0.22625687909155334,-1.1537140210749939,0.24790775926072633,-1.2058520881176007,0.26955863942989927,-1.2579901551602068,0.2912095195990721,-1.3101282222028132,0.31286039976824503,-1.3622662892454198,0.33451127993741792,-1.4144043562880257,0.35616216010659091,-1.4665424233306326,0.37781304027576373,-1.5186804903732392,0.39946392044493684,-1.5708185574158458,0.42111480061410977,-1.6229566244584521,0.44276568078328254,-1.6750946915010585,0.4644165609524557,-1.7272327585436653,0.48606744112162836,-1.7793708255862715,0.50771832129080119,-1.8315088926288781,0.61597272213666554,-2.0921992278419106]
[null,64,3.5728194195492356E-2,-0.64950478487356045,7.1456388390984713E-2,-0.79900956974712078,9.2654569546999757E-2,-0.85215413898270975,0.11385275070301476,-0.90529870821829872,0.13505093185902975,-0.95844327745388758,0.15624911301504479,-1.0115878466894768,0.17744729417105978,-1.0647324159250655,0.19864547532707477,-1.1178769851606545,0.21984365648308979,-1.1710215543962434,0.24104183763910492,-1.2241661236318324,0.26224001879511993,-1.2773106928674214,0.28343819995113484,-1.3304552621030101,0.30463638110714997,-1.3835998313385993,0.32583456226316493,-1.4367444005741881,0.34703274341918,-1.4898889698097768,0.36823092457519502,-1.543033539045366,0.38942910573121003,-1.5961781082809547,0.41062728688722511,-1.6493226775165442,0.43182546804324001,-1.7024672467521327,0.45302364919925497,-1.7556118159877219,0.47422183035527005,-1.8087563852233106,0.49542001151128506,-1.8619009544588996,0.60141091729136009,-2.1276238006368446]
[null,65,3.4007875117187496E-2,-0.65476917968749981,6.8015750234374991E-2,-0.80953835937499963,8.876123237723213E-2,-0.86368943080357108,0.10950671452008928,-0.91784050223214242,0.13025219666294635,-0.97199157366071365,0.15099767880580353,-1.0261426450892852,0.17174316094866066,-1.0802937165178563,0.19248864309151778,-1.1344447879464279,0.2132341252343749,-1.1885958593749992,0.23397960737723211,-1.2427469308035708,0.25472508952008921,-1.2968980022321424,0.27547057166294631,-1.3510490736607135,0.29621605380580357,-1.4052001450892848,0.31696153594866061,-1.4593512165178559,0.33770701809151776,-1.5135022879464275,0.3584525002343748,-1.5676533593749991,0.37919798237723201,-1.6218044308035704,0.39994346452008933,-1.6759555022321422,0.42068894666294626,-1.7301065736607129,0.44143442880580347,-1.7842576450892846,0.46217991094866057,-1.838408716517856,0.48292539309151761,-1.8925597879464271,0.5866528038058032,-2.1633151450892836]
[null,66,{"$f":"E77/2","v":2.9148250492757509E-2},{"$f":"-0.25+F77/2","v":-0.66857968054374073},5.8296500985515018E-2,-0.83715936108748135,7.7658950985515007E-2,-0.89436702775414778,9.7021400985515011E-2,-0.95157469442081444,0.11638385098551496,-1.0087823610874809,0.13574630098551499,-1.0659900277541479,0.15510875098551494,-1.1231976944208144,0.17447120098551488,-1.1804053610874807,0.19383365098551489,-1.2376130277541477,0.21319610098551492,-1.2948206944208145,0.23255855098551487,-1.352028361087481,0.2519210009855149,-1.4092360277541474,0.27128345098551487,-1.4664436944208146,0.29064590098551474,-1.5236513610874807,0.31000835098551488,-1.5808590277541477,0.3293708009855148,-1.638066694420814,0.34873325098551489,-1.6952743610874805,0.36809570098551486,-1.7524820277541475,0.38745815098551473,-1.8096896944208138,0.40682060098551481,-1.8668973610874806,0.42618305098551479,-1.9241050277541472,0.44554550098551476,-1.9813126944208135,{"$f":"2*AS77-AI77","v":0.54235775098551464},{"$f":"2*AT77-AJ77","v":-2.2673510277541462}]
[null,67,2.4663387176359981E-2,-0.68130370600556578,4.9326774352719961E-2,-0.86260741201113167,6.7306192209862808E-2,-0.92287167391589353,8.5285610067005663E-2,-0.9831359358206555,0.10326502792414852,-1.0434001977254173,0.12124444578129137,-1.1036644596301792,0.13922386363843417,-1.163928721534941,0.15720328149557702,-1.2241929834397027,0.17518269935271988,-1.2844572453444647,0.19316211720986279,-1.3447215072492269,0.21114153506700556,-1.4049857691539887,0.22912095292414839,-1.4652500310587504,0.24710037078129132,-1.5255142929635122,0.26507978863843407,-1.5857785548682739,0.28305920649557703,-1.6460428167730363,0.30103862435271977,-1.7063070786777976,0.31901804220986257,-1.7665713405825594,0.33699746006700559,-1.8268356024873216,0.35497687792414828,-1.8870998643920833,0.37295629578129119,-1.9473641262968455,0.3909357136384341,-2.0076283882016073,0.40891513149557679,-2.0678926501063688,0.498812220781291,-2.3692139596301782]
[null,68,2.0553304736483875E-2,-0.69294155712665373,4.1106609472967751E-2,-0.88588311425330746,5.7702995187253456E-2,-0.94920397139616464,7.4299380901539147E-2,-1.0125248285390216,9.0895766615824852E-2,-1.0758456856818788,0.10749215233011057,-1.139166542824736,0.12408853804439621,-1.2024873999675929,0.14068492375868191,-1.2658082571104499,0.15728130947296765,-1.329129114253307,0.17387769518725338,-1.3924499713961644,0.19047408090153906,-1.4557708285390214,0.20707046661582471,-1.5190916856818786,0.22366685233011047,-1.5824125428247355,0.24026323804439606,-1.6457333999675927,0.25685962375868188,-1.7090542571104499,0.2734560094729675,-1.7723751142533071,0.29005239518725318,-1.8356959713961642,0.30664878090153902,-1.8990168285390214,0.32324516661582459,-1.9623376856818782,0.33984155233011032,-2.0256585428247353,0.35643793804439605,-2.0889793999675925,0.37303432375868162,-2.1523002571104493,0.45601625233011006,-2.4689045428247343]
[null,69,1.6818011579852906E-2,-0.70349336664992879,3.3636023159705812E-2,-0.90698673329985757,4.8849376731134382E-2,-0.97336418568080985,6.4062730302562945E-2,-1.0397416380617623,7.927608387399146E-2,-1.1061190904427147,9.4489437445420085E-2,-1.1724965428236671,0.10970279101684861,-1.2388739952046193,0.12491614458827714,-1.3052514475855714,0.14012949815970571,-1.3716288999665238,0.15534285173113432,-1.4380063523474762,0.17055620530256285,-1.5043838047284288,0.18576955887399135,-1.5707612571093807,0.20098291244541999,-1.6371387094903336,0.21619626601684849,-1.7035161618712853,0.23140961958827708,-1.7698936142522379,0.24662297315970558,-1.8362710666331903,0.26183632673113427,-1.9026485190141427,0.27704968030256283,-1.9690259713950951,0.29226303387399133,-2.0354034237760472,0.30747638744541989,-2.1017808761569996,0.32268974101684839,-2.168158328537952,0.33790309458827689,-2.2345357809189044,0.4139698624454195,-2.5664230428236658]
[null,70,1.3457530563267948E-2,-0.71295955015359136,2.6915061126535897E-2,-0.92591910030718272,4.0745382555107318E-2,-0.99535314792623031,5.4575703983678739E-2,-1.0647871955452779,6.8406025412250146E-2,-1.1342212431643253,8.2236346840821581E-2,-1.2036552907833731,9.6066668269392974E-2,-1.2730893384024204,0.1098969896979644,-1.3425233860214683,0.12372731112653583,-1.4119574336405158,0.13755763255510728,-1.4813914812595634,0.15138795398367869,-1.5508255288786108,0.16521827541225004,-1.6202595764976582,0.17904859684082153,-1.6896936241167062,0.19287891826939293,-1.7591276717357536,0.20670923969796426,-1.8285617193548009,0.22053956112653575,-1.8979957669738488,0.23436988255510716,-1.9674298145928963,0.24820020398367862,-2.0368638622119439,0.26203052541224997,-2.1062979098309911,0.27586084684082152,-2.1757319574500387,0.28969116826939284,-2.2451660050690867,0.30352148969796422,-2.3146000526881338,0.37267309684082128,-2.6617702907833714]
[null,71,1.0471881465489118E-2,-0.72134051221290152,2.0943762930978237E-2,-0.94268102442580293,3.3391052216692522E-2,-1.0151716672829456,4.5838341502406815E-2,-1.0876623101400884,5.8285630788121073E-2,-1.1601529529972312,7.0732920073835387E-2,-1.232643595854374,8.3180209359549645E-2,-1.3051342387115168,9.5627498645263903E-2,-1.3776248815686596,0.1080747879309782,-1.4501155244258024,0.12052207721669253,-1.5226061672829454,0.13296936650240682,-1.595096810140088,0.14541665578812107,-1.6675874529972305,0.15786394507383536,-1.7400780958543736,0.17031123435954959,-1.8125687387115161,0.18275852364526385,-1.8850593815686592,0.19520581293097819,-1.9575500244258017,0.20765310221669245,-2.0300406672829445,0.22010039150240687,-2.1025313101400882,0.23254768078812102,-2.1750219529972306,0.24499497007383539,-2.2475125958543734,0.25744225935954956,-2.3200032387115157,0.26988954864526393,-2.3924938815686589,0.33212599507383544,-2.7549470958543734]
[null,72,7.8610954544633248E-3,-0.72863699355177458,1.572219090892665E-2,-0.95727398710354916,2.6786448051783786E-2,-1.0328212251987872,3.7850705194640927E-2,-1.1083684632940254,4.891496233749805E-2,-1.1839157013892632,5.9979219480355214E-2,-1.2594629394845016,7.1043476623212337E-2,-1.3350101775797394,8.210773376606946E-2,-1.4105574156749772,9.3171990908926611E-2,-1.4861046537702156,0.10423624805178376,-1.5616518918654538,0.11530050519464094,-1.6371991299606916,0.12636476233749802,-1.7127463680559296,0.13742901948035519,-1.7882936061511678,0.14849327662321229,-1.8638408442464054,0.15955753376606949,-1.9393880823416436,0.1706217909089266,-2.0149353204368818,0.18168604805178373,-2.0904825585321198,0.19275030519464087,-2.1660297966273583,0.20381456233749801,-2.2415770347225958,0.21487881948035523,-2.3171242728178343,0.22594307662321228,-2.3926715109130723,0.23700733376606939,-2.4682187490083098,0.29232861948035505,-2.8459549394844998]
[null,73,5.6252079019543568E-3,-0.73485010240896043,1.1250415803908714E-2,-0.96970020481792096,2.0931640803908712E-2,-1.0483040381512543,3.0612865803908706E-2,-1.1269078714845875,4.0294090803908687E-2,-1.2055117048179207,4.9975315803908703E-2,-1.2841155381512541,5.9656540803908704E-2,-1.3627193714845871,6.9337765803908671E-2,-1.4413232048179205,7.9018990803908715E-2,-1.519927038151254,8.8700215803908716E-2,-1.5985308714845874,9.8381440803908704E-2,-1.6771347048179206,0.10806266580390871,-1.7557385381512538,0.11774389080390869,-1.8343423714845868,0.12742511580390864,-1.91294620481792,0.13710634080390868,-1.9915500381512534,0.14678756580390875,-2.0701538714845866,0.15646879080390874,-2.1487577048179203,0.16615001580390873,-2.2273615381512535,0.17583124080390861,-2.3059653714845862,0.1855124658039087,-2.3845692048179199,0.19519369080390866,-2.4631730381512531,0.20487491580390868,-2.5417768714845863,0.25328104080390862,-2.9347960381512523]
[null,74,3.7642552870983045E-3,-0.739981723416824,7.5285105741966091E-3,-0.979963446833648,1.5826703431339472E-2,-1.0616238754050766,2.4124896288482335E-2,-1.1432843039765053,3.2423089145625188E-2,-1.2249447325479337,4.0721282002768054E-2,-1.3066051611193621,4.90194748599109E-2,-1.3882655896907905,5.7317667717053773E-2,-1.4699260182622189,6.5615860574196633E-2,-1.5515864468336478,7.3914053431339513E-2,-1.6332468754050764,8.221224628848231E-2,-1.7149073039765048,9.0510439145625191E-2,-1.796567732547933,9.8808632002768057E-2,-1.8782281611193616,0.10710682485991092,-1.9598885896907901,0.1154050177170538,-2.0415490182622182,0.12370321057419666,-2.1232094468336471,0.13200140343133948,-2.2048698754050755,0.1402995962884824,-2.2865303039765048,0.14859778914562519,-2.3681907325479328,0.15689598200276803,-2.4498511611193612,0.16519417485991095,-2.5315115896907896,0.17349236771705379,-2.613172018262218,0.21498333200276809,-3.0214741611193605]
[null,75,2.2782472053780034E-3,-0.74403518559815418,4.5564944107560068E-3,-0.98807037119630836,1.1471655125041726E-2,-1.072787395005832,1.8386815839327445E-2,-1.1575044188153558,2.5301976553613159E-2,-1.2422214426248794,3.2217137267898883E-2,-1.3269384664344033,3.9132297982184587E-2,-1.4116554902439269,4.6047458696470298E-2,-1.4963725140534507,5.2962619410756029E-2,-1.5810895378629746,5.987778012504176E-2,-1.6658065616724982,6.6792940839327491E-2,-1.750523585482022,7.3708101553613181E-2,-1.8352406092915459,8.0623262267898982E-2,-1.9199576331010695,8.7538422982184616E-2,-2.0046746569105931,9.4453583696470389E-2,-2.0893916807201172,0.10136874441075608,-2.1741087045296408,0.1082839051250418,-2.2588257283391644,0.11519906583932753,-2.343542752148688,0.1221142265536132,-2.4282597759582116,0.12902938726789898,-2.5129767997677357,0.13594454798218472,-2.5976938235772593,0.14285970869647036,-2.6824108473867829,0.17743551226789891,-3.1059959664344015]
[null,76,1.1670465552772356E-3,-0.7470172186567946,2.3340931105544712E-3,-0.9940344373135892,7.8662216819830409E-3,-1.0818080563612082,1.3398350253411611E-2,-1.1695816754088273,1.8930478824840169E-2,-1.2573552944564459,2.4462607396268751E-2,-1.3451289135040652,2.9994735967697316E-2,-1.432902532551684,3.5526864539125867E-2,-1.5206761515993032,4.1058993110554456E-2,-1.6084497706469221,4.6591121681983025E-2,-1.6962233896945411,5.2123250253411572E-2,-1.7839970087421604,5.7655378824840162E-2,-1.871770627789779,6.3187507396268716E-2,-1.959544246837398,6.8719635967697257E-2,-2.0473178658850166,7.4251764539125908E-2,-2.1350914849326359,7.9783893110554435E-2,-2.2228651039802547,8.5316021681983004E-2,-2.310638723027874,9.0848150253411572E-2,-2.3984123420754933,9.6380278824840154E-2,-2.4861859611231116,0.10191240739626867,-2.5739595801707313,0.10744453596769725,-2.6617331992183497,0.11297666453912583,-2.7495068182659685,0.14063730739626867,-3.1883749135040631]
[null,77,4.2977842564685838E-4,-0.74894346672672474,8.5955685129371676E-4,-0.99788693345344937,5.0086532798651502E-3,-1.0887171477391637,9.1577497084365835E-3,-1.179547362024878,1.3306846137008015E-2,-1.270377576310592,1.7455942565579453E-2,-1.3612077905963063,2.1605038994150866E-2,-1.4520380048820203,2.5754135422722316E-2,-1.5428682191677345,2.9903231851293729E-2,-1.633698433453449,3.4052328279865186E-2,-1.7245286477391633,3.820142470843662E-2,-1.8153588620248773,4.2350521137008018E-2,-1.9061890763105915,4.6499617565579486E-2,-1.9970192905963058,5.0648713994150905E-2,-2.0878495048820196,5.4797810422722339E-2,-2.1786797191677345,5.8946906851293744E-2,-2.2695099334534481,6.3096003279865198E-2,-2.3603401477391621,6.7245099708436673E-2,-2.451170362024877,7.1394196137007954E-2,-2.5420005763105906,7.5543292565579512E-2,-2.6328307905963051,7.9692388994150945E-2,-2.7236610048820196,8.3841485422722309E-2,-2.8144912191677331,0.10458696756557942,-3.2686422905963042]
[null,78,6.0899892190450121E-5,-0.74986089980439985,1.2179978438090024E-4,-0.9997217996087997,2.8878640700951896E-3,-1.0936086091326092,5.653928355809479E-3,-1.1874954186564186,8.4199926415237675E-3,-1.2813822281802281,1.1186056927238059E-2,-1.3752690377040377,1.3952121212952357E-2,-1.469155847227847,1.6718185498666636E-2,-1.5630426567516564,1.9484249784380951E-2,-1.6569294662754654,2.2250314070095221E-2,-1.7508162757992753,2.5016378355809551E-2,-1.844703085323085,2.7782442641523811E-2,-1.938589894846894,3.0548506927238109E-2,-2.0324767043707039,3.3314571212952379E-2,-2.1263635138945132,3.6080635498666733E-2,-2.2202503234183224,3.8846699784380996E-2,-2.3141371329421316,4.1612764070095259E-2,-2.4080239424659413,4.437882835580953E-2,-2.501910751989751,4.7144892641523918E-2,-2.5957975615135602,4.9910956927238188E-2,-2.6896843710373699,5.2677021212952452E-2,-2.7835711805611791,5.5443085498666715E-2,-2.8774579900849884,6.9273406927238171E-2,-3.3468920377040354]
[null,79,0,-0.749999999999999,0,-0.999999999999998,1.3830321428571529E-3,-1.0969434047619027,2.7660642857143059E-3,-1.1938868095238071,4.1490964285714619E-3,-1.290830214285712,5.5321285714286118E-3,-1.3877736190476166,6.9151607142857764E-3,-1.4847170238095211,8.2981928571429237E-3,-1.5816604285714257,9.6812250000000884E-3,-1.6786038333333309,1.1064257142857224E-2,-1.7755472380952355,1.2447289285714386E-2,-1.8724906428571402,1.3830321428571553E-2,-1.9694340476190446,1.5213353571428716E-2,-2.0663774523809497,1.6596385714285847E-2,-2.1633208571428533,1.7979417857143014E-2,-2.2602642619047582,1.9362450000000177E-2,-2.3572076666666635,2.0745482142857343E-2,-2.4541510714285679,2.2128514285714447E-2,-2.5510944761904728,2.3511546428571672E-2,-2.6480378809523772,2.4894578571428773E-2,-2.7449812857142821,2.6277610714286002E-2,-2.841924690476187,2.7660642857143106E-2,-2.938868095238091,3.4575803571428865E-2,-3.4235851190476141]
[null,80,0,-0.749999999999999,0,-0.999999999999998,0,-1.0999999999999979,0,-1.1999999999999977,0,-1.2999999999999976,0,-1.3999999999999977,0,-1.4999999999999973,0,-1.5999999999999974,0,-1.6999999999999973,0,-1.7999999999999976,0,-1.8999999999999972,0,-1.9999999999999971,0,-2.0999999999999974,0,-2.1999999999999966,0,-2.2999999999999967,0,-2.3999999999999968,0,-2.4999999999999969,0,-2.5999999999999974,0,-2.6999999999999962,0,-2.7999999999999972,0,-2.8999999999999959,0,-2.999999999999996,0,-3.4999999999999951]
[null,81,{"$f":"-C90","v":0},{"$f":"D90","v":-0.749999999999999},{"$f":"-E90","v":0},{"$f":"F90","v":-0.999999999999998},{"$f":"-G90","v":-1.3830321428571529E-3},{"$f":"H90","v":-1.0969434047619027},{"$f":"-I90","v":-2.7660642857143059E-3},{"$f":"J90","v":-1.1938868095238071},{"$f":"-K90","v":-4.1490964285714619E-3},{"$f":"L90","v":-1.290830214285712},{"$f":"-M90","v":-5.5321285714286118E-3},{"$f":"N90","v":-1.3877736190476166},{"$f":"-O90","v":-6.9151607142857764E-3},{"$f":"P90","v":-1.4847170238095211},{"$f":"-Q90","v":-8.2981928571429237E-3},{"$f":"R90","v":-1.5816604285714257},{"$f":"-S90","v":-9.6812250000000884E-3},{"$f":"T90","v":-1.6786038333333309},{"$f":"-U90","v":-1.1064257142857224E-2},{"$f":"V90","v":-1.7755472380952355},{"$f":"-W90","v":-1.2447289285714386E-2},{"$f":"X90","v":-1.8724906428571402},{"$f":"-Y90","v":-1.3830321428571553E-2},{"$f":"Z90","v":-1.9694340476190446},{"$f":"-AA90","v":-1.5213353571428716E-2},{"$f":"AB90","v":-2.0663774523809497},{"$f":"-AC90","v":-1.6596385714285847E-2},{"$f":"AD90","v":-2.1633208571428533},{"$f":"-AE90","v":-1.7979417857143014E-2},{"$f":"AF90","v":-2.2602642619047582},{"$f":"-AG90","v":-1.9362450000000177E-2},{"$f":"AH90","v":-2.3572076666666635},{"$f":"-AI90","v":-2.0745482142857343E-2},{"$f":"AJ90","v":-2.4541510714285679},{"$f":"-AK90","v":-2.2128514285714447E-2},{"$f":"AL90","v":-2.5510944761904728},{"$f":"-AM90","v":-2.3511546428571672E-2},{"$f":"AN90","v":-2.6480378809523772},{"$f":"-AO90","v":-2.4894578571428773E-2},{"$f":"AP90","v":-2.7449812857142821},{"$f":"-AQ90","v":-2.6277610714286002E-2},{"$f":"AR90","v":-2.841924690476187},{"$f":"-AS90","v":-2.7660642857143106E-2},{"$f":"AT90","v":-2.938868095238091},{"$f":"-AU90","v":-3.4575803571428865E-2},{"$f":"AV90","v":-3.4235851190476141}]