{"text_format":"1","workbook":"xlsx","n_sheets":7,"sheets":["Übersicht","Dateneingabe","SD_Linien","SD_Verteilung","MNID","Datenbasis","Speicherung"],"not_rendered":{"charts":7,"images":6,"macros":1,"external_links":0,"defined_names":37,"comments":1,"pivot_tables":0},"unopened":[],"bounds":{"document_bytes":16777216,"sheet_cells":100000,"rows_first":2000,"rows_last":500,"rows_between":2000,"halvings":0,"cell_chars":16384,"cell_head_chars":4096},"cells_cut":0,"cells_raw":0,"read":"whole","date_system":"1900"}

{"sheet":"Übersicht","index":0,"n_rows":17,"n_cols":10,"rows_kept":17,"cut":false,"hidden":false,"merged":[]}
[]
[null,"(0) M - N - Interaktionsdiagramme nach DIN EN 1992-1-1  (EC2)"]
[null,"zur Bemessung von symmetrisch bewehrten Rechteck- und Kreisprofilen aus Stahlbeton"]
[]
[null,"Zur Auswahl stehen:",null,"Rechteckquerschnitt mit Rand- und umlaufender Bewehrungsanordnung"]
[null,null,null,"Kreisquerschnitte mit umlaufender Bewehrungsanordnung"]
[null,null,null,"Normalbetone von C 12/15 bis C 100/115"]
[null,null,null,"Leichbetone von LC 12/13 bis LC 60/66"]
[null,null,null,"Beliebige Bemessungsschnittgrößen NEd und MEd"]
[]
[null,"Berechnet werden:",null,"Spannungs-Dehnungsverlauf für ausgewählten Beton"]
[null,null,null,"Verteilung der Spannungen und Dehnungen über Querschnittshöhe"]
[null,null,null,"M-N-Interaktionsdiagramm zum Ablesen des Bewehrungsgrades"]
[null,null,null,"erforderliche Bewehrung für ausgewählten Querschnitt und vorgegebene …"]
[null,null,null,"                                   … Kombination der Bemessungsschnittgrößen"]
{"$rows_left_out":3}
{"sheet":"Dateneingabe","index":1,"n_rows":27,"n_cols":11,"rows_kept":27,"cut":false,"hidden":false,"merged":[]}
[]
[null,"[1] Dateneingabe",null,{"$f":"IF(Datenbasis!K116=\"Nein\",\"\",\"Bitte Diagramme neu berechnen!\")","v":""},null,null,null,null,null,null,"weiter"]
[null,null,null,null,null,null,"Beiwert für Bauteileigenschaften",null,null,null,"Dimension"]
[null,"Teilsicherheitsbeiwert",null,null,null,"gc =",{"$f":"Datenbasis!E9","v":1.5},"Teilsicherheitsbeiwert für Beton",null,null,"[ - ]"]
[null,null,null,null,null,"gs =",{"$f":"Datenbasis!F9","v":1.1499999999999999},"Teilsicherheitsbeiwert für Betonstahl",null,null,"[ - ]"]
[]
[null,"Betonfestigkeitsklasse",null,null,null,null,"Parameter der Spannungs-Dehnungslinie des Betons"]
[null,null,null,null,null,"fcd =",{"$f":"Datenbasis!$G$23","v":1.4166666666666667},"Bemessungswert für die Druckfestigkeit",null,null,"[kN/cm²]"]
[null,null,"Betonstauchung bei ed/ h £ 0,1 bis eyd zulassen",null,null,"ec2 =",{"$f":"Datenbasis!$D$23","v":-2},"Betondehnung bei Erreichen von fcd",null,null,"[o/oo]"]
[null,null,"mit ed = MEd / NEd",null,null,"ec2u =",{"$f":"Datenbasis!$E$23","v":-3.5},"Grenzdehnung am Druckrand",null,null,"[o/oo]"]
[null,null,"ed / h =",{"$f":"ABS(I19/G19/I22*100)","v":0.41666666666666669},null,"n =",{"$f":"Datenbasis!$F$23","v":2},"Fülligkeitsbeiwert für Parabelfunktion",null,null,"[ - ]"]
[]
[null,"Betonstahlgüte",null,null,null,null,"Parameter der Spannungs-Dehnungslinie des Betonstahls"]
[null,null,null,null,null,"fyd =",{"$f":"Datenbasis!E16","v":43.478260869565219},"Bemessungswert für die Streckgrenze",null,null,"[kN/cm²]"]
[null,null,null,null,null,"ftd =",{"$f":"Datenbasis!F16","v":45.652173913043484},"Bemessungswert für die Zugfestigkeit ",null,null,"[kN/cm²]"]
{"$rows_left_out":13}
{"sheet":"SD_Linien","index":2,"n_rows":4,"n_cols":11,"rows_kept":4,"cut":false,"hidden":false,"merged":[]}
[]
[null,"(2) Spannungs-Dehnungslinien für ausgewählte Werkstoffe",null,null,null,null,null,null,null,"zurück","weiter"]
[]
[null,null,null,"Spannungs-Dehnungslinie für ",null,"und ",null," bei einer"]

{"sheet":"SD_Verteilung","index":3,"n_rows":23,"n_cols":11,"rows_kept":23,"cut":false,"hidden":false,"merged":[[7,6,17,6]]}
[]
[null,"(3) Dehnungs- und Spannungsverteilung über Querschnittshöhe infolge NEd und MEd"]
[]
[null,null,null,"Betongüte",null,"    bei einer",null,null,null,"zurück","weiter"]
[null,{"$f":"CONCATENATE(\"Dehnungsverteilung für DZ = \",F18)","v":"Dehnungsverteilung für DZ = 58"},null,null,null,null,null,"zugehörige Beton-Spannungsverteilung (mit Resultierender)"]
[null,null,null,null,null,"DZ"]
[null,null,null,null,null,1,"Rand (2)"]
[null,null,null,null,null,null,"am normierten Querschnitt (h = 1,0 m)"]
[]
[]
[]
[]
[]
[]
[]
{"$rows_left_out":9}
{"sheet":"MNID","index":4,"n_rows":25,"n_cols":11,"rows_kept":25,"cut":false,"hidden":false,"merged":[[4,0,24,0]]}
[]
[null,"(4) M-N-Interaktionsdiagramme für ausgewählten Querschnitt",null,null,null,null,null,null,null,"zurück"]
[null,"Bemessungssituation",null,{"$f":"Datenbasis!F7","v":"Grundkombination"},null,"Querschnitt",{"$f":"Datenbasis!L6","v":"Rechteck mit As1 = As2"},null,{"$f":"CONCATENATE(\"(\" & Datenbasis!G4 & \")\")","v":"(Beton-Bruttoquerschnitt)"}]
[]
[{"$f":"Dateneingabe!D2","v":""},null,null,null,null,null,null,"Betongüte",{"$f":"Datenbasis!B61","v":"C 25/30"}]
[null,null,null,null,null,null,null,null,{"$f":"CONCATENATE(\"f_ yd = \",ROUND(10*Datenbasis!G61,3))","v":"f_ yd = 14,167"},"[MN/m²]"]
[null,null,null,null,null,null,null,"Bewehrung",{"$f":"Datenbasis!E14","v":"B 500 SA"},{"$f":"Datenbasis!F14","v":"ftd > fyd"}]
[null,null,null,null,null,null,null,null,"fyd / fcd =",{"$f":"Datenbasis!E16/Datenbasis!G61","v":30.690537084398976}]
[null,null,null,null,null,null,null,"Abmessung",{"$f":"CONCATENATE(\"b / h = \" & Dateneingabe!G22 & \" cm / \" & Dateneingabe!I22 & \" cm\")","v":"b / h = 40 cm / 60 cm"}]
[null,null,null,null,null,null,null,null,{"$f":"CONCATENATE(\"b0 / h0 = \" & Dateneingabe!G23 & \" cm / \" & Dateneingabe!I23 & \" cm\")","v":"b0 / h0 = 0 cm / 0 cm"}]
[null,null,null,null,null,null,null,"Bew.-lage","d1 / h = d2 / h =",{"$f":"Datenbasis!P6","v":0.05},1]
[null,null,null,null,null,null,null,{"$f":"CONCATENATE(\"Dehnungen bei interp. DZ = \", ROUND(Datenbasis!G104,1))","v":"Dehnungen bei interp. DZ = 58,4"}]
[null,null,null,null,null,null,null,"ec2 =",{"$f":"Datenbasis!G107","v":-3.5},"[o/oo]"]
[null,null,null,null,null,null,null,"es2 =",{"$f":"Datenbasis!G108","v":-3.286595081433247},"[o/oo]"]
[null,null,null,null,null,null,null,"es1 =",{"$f":"Datenbasis!G109","v":0.55469345276830517},"[o/oo]"]
{"$rows_left_out":11}
{"sheet":"Datenbasis","index":5,"n_rows":129,"n_cols":33,"rows_kept":129,"cut":false,"hidden":false,"merged":[[1,18,1,20],[10,1,10,3],[11,1,11,3],[6,9,6,10],[5,11,5,12],[9,9,9,10],[10,9,10,10],[11,9,11,10],[20,19,20,20],[20,21,20,22],[12,9,12,10],[13,9,13,10],[7,9,7,10]]}
[]
[null,"Betonart","Stahllinie","Druckstauchung bei geringer Ausmitte",null,null,"Netto-Beton",null,null,"außen","[cm]","innen","[cm]",null,"Bew.-Lage","Einheits-Querschn. [cm]",null,null,{"$f":"INDEX(Datenbasis!J10:J14,J6)","v":"Rechteck mit As1 = As2"}]
[null,1,{"$f":"IF(C5,1,2)","v":2},{"$f":"IF(B3=2,2,IF(D5,1,2))","v":1},null,null,{"$f":"IF(G5,1,0)","v":0},null,null,"h =",{"$f":"Dateneingabe!I22","v":60},"h0 =",{"$f":"Dateneingabe!I23","v":0},null,"h =",{"$f":"Q4-Q3","v":100},-50,null,"eps_0 =",{"$f":"L17","v":-1.3146453089244855E-3},"kappa =",{"$f":"M17","v":4.3707093821510291E-3},"d1/h =",{"$f":"P4/GDicke","v":0.05},"As,tot =",{"$f":"Q17","v":423.58333333333337}]
[null,"Normalb. = 1","Lin. I/II = 1/2","nur bei Normalbeton und ed / h <=0,1",null,null,{"$f":"IF(G5,\"Beton-Nettoquerschnitt\",\"Beton-Bruttoquerschnitt\")","v":"Beton-Bruttoquerschnitt"},null,null,"b =",{"$f":"Dateneingabe!G22","v":40},"b0 =",{"$f":"Dateneingabe!G23","v":0},null,"d1 = d2 =",{"$f":"Dateneingabe!G26*GDicke","v":5},50,null,null,null,null,null,null,{"$f":"X18","v":6.5217391304347744E-4},{"$f":"SDStahl(X4,$H$16,$H$14,$E$16,$F$16)","v":13.043478260869549}]
[null,"Leichtb. = 2",false,true,"zugel.=1; nicht zugel.=2",null,false,null,null,"h0 / h =",{"$f":"M3/K3","v":0},"b0 / b =",{"$f":"M4/K4","v":0},null,"d =",{"$f":"GDicke-P4","v":95},null,null,"Stahlfasern",{"$f":"Datenbasis!M8","v":2},"[cm²]",null,"[cm²]","[o/oo]","[kN/cm²]","[kN]","[kNm]",null,"Kreisquerschnitt (Hilfsrechnung)",null,null,"2*12 Eisen","gesAs / 12"]
[null,null,null,null,null,null,null,null,null,1,null,{"$f":"J8","v":"Rechteck mit As1 = As2"},null,null,"d1 / h =",{"$f":"P4/GDicke","v":0.05},null,null,"j","z(i) [m]","As(i)","z(i) [m]","As(i)","epss(j)","sigms(i)","ns(i)","ms(i)",null,"i","Winkel","alfa [BM]","z(i) [m]","As(i)"]
[null,1,"Kombinationsauswahl",null,null,{"$f":"INDEX(B11:B12,B7)","v":"Grundkombination"},null,null,null,"Auswahl:  Querschnitt",null,"Layer","Bewehrung","A / (b * h )","A [cm²]","Hinweis","Bild",null,1,{"$f":"(ROben+$P$4)/100","v":-0.45},{"$f":"IF($T$5=2,$Z$3/2,$Z$3/4)","v":211.79166666666669},{"$f":"IF($J$6>2,AF7,T7)","v":-0.45},{"$f":"IF($J$6>2,AG7,U7)","v":211.79166666666669},{"$f":"$T$3+T7*$V$3","v":-3.2814645308924485E-3},{"$f":"IF($G$3=0,SDStahl(X7,$H$16,$H$14,$E$16,$F$16),SDStahl(X7,$H$16,$H$14,$E$16,$F$16)-SDBeton(X7,$D$23/1000,$G$23,$F$23))","v":-43.583741963604666},{"$f":"W7*Y7","v":-9230.6733500417722},{"$f":"Z7*V7","v":4153.803007518798},null,1,7.5,{"$f":"-COS(AD7*PI()/180)","v":-0.99144486137381038},{"$f":"(GDicke/2-$P$4)*AE7/100","v":-0.44615018761821468},{"$f":"$Z$3/12","v":35.298611111111114}]
[null,"Kombination",null,null,"gam_c","gam_s",null,null,null,{"$f":"INDEX(J10:J14,$J$6)","v":"Rechteck mit As1 = As2"},null,{"$f":"INDEX(L10:L14,$J$6)","v":100},{"$f":"INDEX(M10:M14,$J$6)","v":2},{"$f":"INDEX(N10:N14,$J$6)","v":1},2400,"",{"$f":"INDEX(Q10:Q14,$J$6)","v":"QGrafik1"},null,2,{"$f":"$T$7+(GDicke-2*$P$4)/2000","v":-0.40500000000000003},{"$f":"IF($T$5=2,0,$Z$3/20)","v":0},{"$f":"IF($J$6>2,AF8,T8)","v":-0.40500000000000003},{"$f":"IF($J$6>2,AG8,U8)","v":0},{"$f":"$T$3+T8*$V$3","v":-3.0847826086956524E-3},{"$f":"SDStahl(X8,$H$16,$H$14,$E$16,$F$16)","v":-43.565010351966876},{"$f":"W8*Y8","v":0},{"$f":"Z8*V8","v":0},null,2,{"$f":"AD7+15","v":22.5},{"$f":"-COS(AD8*PI()/180)","v":-0.92387953251128674},{"$f":"(GDicke/2-$P$4)*AE8/100","v":-0.41574578963007902},{"$f":"$Z$3/12","v":35.298611111111114}]
[null,null,null,null,{"$f":"INDEX(E11:E12,$B$7)","v":1.5},{"$f":"INDEX(F11:F12,$B$7)","v":1.1499999999999999},null,null,null,null,null,"Layer","Bewehrung","A / (b * h )","A [cm²]","Hinweis","Bild",null,3,{"$f":"$T$7+(GDicke-2*$P$4)/2000*3","v":-0.315},{"$f":"$U$8","v":0},-0.315,0,-2.6914187643020597E-3,-43.527547128691296,0,0,null,3,{"$f":"AD8+15","v":37.5},-0.79335334029123517,-0.35700900313105582,35.298611111111114]
[null,"Kombination",null,null,"gam_c","gam_s",null,null,null,"Rechteck mit As1 = As2",null,100,2,{"$f":"O10/$K$3/$K$4","v":1},{"$f":"$K$3*$K$4-$M$3*$M$4","v":2400},{"$f":"\"\"","v":""},"QGrafik1",null,4,{"$f":"$T$7+(GDicke-2*$P$4)/2000*5","v":-0.22500000000000003},0,-0.22500000000000003,0,-2.298054919908467E-3,-43.490083905415716,0,0,null,4,52.5,-0.60876142900872066,-0.2739426430539243,35.298611111111114]
[null,"Grundkombination",null,null,1.5,1.1499999999999999,null,null,null,"I- / H-Profil mit As1 = As2",null,100,2,{"$f":"O11/$K$3/$K$4","v":1},{"$f":"$K$3*$K$4-$M$3*$M$4","v":2400},"<-- Eingabe !","QGrafik2",null,5,{"$f":"$T$7+(GDicke-2*$P$4)/2000*7","v":-0.13500000000000001},0,-0.13500000000000001,0,-1.9046910755148745E-3,-38.093821510297488,0,0,null,5,67.5,-0.38268343236508984,-0.17220754456429041,35.298611111111114]
[null,"Außergewöhnliche Kombination",null,null,1.3,1,null,null,null,"Hohlprofil mit umlfd. As,tot",null,100,12,1,2400,"<-- Eingabe !","QGrafik3",null,6,{"$f":"$T$7+(GDicke-2*$P$4)/2000*9","v":-4.500000000000004E-2},0,-4.500000000000004E-2,0,-1.5113272311212821E-3,-30.226544622425642,0,0,null,6,82.5,-0.13052619222005171,-5.8736786499023273E-2,35.298611111111114]
[null,null,null,null,null,null,null,null,null,"Rechteck mit umlfd. As,tot",null,100,12,1,2400,{"$f":"\"\"","v":""},"QGrafik3",null,7,{"$f":"$T$7+(GDicke-2*$P$4)/2000*11","v":4.4999999999999984E-2},0,4.4999999999999984E-2,0,-1.1179633867276894E-3,-22.359267734553789,0,0,null,7,97.5,0.13052619222005138,5.8736786499023121E-2,35.298611111111114]
[null,1,"Stahlparameter",null,{"$f":"INDEX(B18:B19,B14)","v":"B 500 SA"},{"$f":"IF(C3=2,\"ftd > fyd\",\"fyd = ftd\")","v":"ftd > fyd"},20000,2.5000000000000001E-2,null,"Ellipsoid mit umlfd. As,tot",null,100,12,0.78539816339744828,{"$f":"PI()/4*($K$3*$K$4-$M$3*$M$4)","v":1884.9555921538758},"<-- Eingabe !","QGrafik4",null,8,{"$f":"$T$7+(GDicke-2*$P$4)/2000*13","v":0.13499999999999995},0,0.13499999999999995,0,-7.2459954233409683E-4,-14.491990846681936,0,0,null,8,112.5,0.38268343236508973,0.17220754456429038,35.298611111111114]
[null,"Stahlgüte","f_yk","f_tk","f_yd","f_td","eps_yk","eps_yd",null,"",null,null,null,null,null,null,null,null,9,{"$f":"$T$7+(GDicke-2*$P$4)/2000*15","v":0.22499999999999992},0,0.22499999999999992,0,-3.3123569794050426E-4,-6.6247139588100854,0,0,null,9,127.5,0.60876142900872066,0.2739426430539243,35.298611111111114]
{"$rows_left_out":115}
{"sheet":"Speicherung","index":6,"n_rows":92,"n_cols":48,"rows_kept":92,"cut":false,"hidden":false,"merged":[[1,10,2,10],[3,10,4,10],[1,1,2,3],[1,7,2,8],[3,7,4,8]]}
[]
[null,"Alle Dehnungszustände und Bew-grade durchlaufen und Ergebnisse speichern",null,null,null,null,null,"Dehnungszustand auswählen",null,null,"Eintragen"]
[]
[null,null,null,null,null,null,null,"Bewehrungsgrad auswählen",null,null,"Löschen"]
[null,"omega",{"$f":"Datenbasis!P54","v":1.3},{"$f":"Datenbasis!O16","v":14},{"$f":"D5*2+1","v":29},0.02]
[]
[null,"n","muecd","nuecd",null,null,null,{"$f":"Dateneingabe!D2","v":""}]
[null,{"$f":"Datenbasis!K17","v":58},{"$f":"Datenbasis!$P$52","v":0.48914430018624899},{"$f":"Datenbasis!$P$53","v":-1.1048486498712451}]
[null,null,-0.1,"=extrapoliert",0,null,0.1,null,0.2,null,0.3,null,0.4,null,0.5,null,0.6,null,0.7,null,0.8,null,0.9,null,1,null,1.1000000000000001,null,1.2,null,1.3,null,1.4,null,1.5,null,1.6,null,1.7,null,1.8,null,1.9,null,2,null,2.5,"= extrapoliert"]
[null,"n",{"$f":"C7","v":"muecd"},{"$f":"D7","v":"nuecd"},{"$f":"C10","v":"muecd"},{"$f":"D10","v":"nuecd"},{"$f":"E10","v":"muecd"},{"$f":"F10","v":"nuecd"},{"$f":"G10","v":"muecd"},"nuecd","muecd","nuecd","muecd","nuecd","muecd","nuecd","muecd","nuecd","muecd","nuecd","muecd","nuecd","muecd","nuecd","muecd","nuecd","muecd","nuecd","muecd","nuecd","muecd","nuecd","muecd","nuecd","muecd","nuecd","muecd","nuecd","muecd","nuecd","muecd","nuecd","muecd","nuecd",{"$f":"AQ10","v":"muecd"},{"$f":"AR10","v":"nuecd"},{"$f":"AS10","v":"muecd"},{"$f":"AT10","v":"nuecd"}]
[null,0,{"$f":"-C13","v":0},{"$f":"D13","v":-0.25},{"$f":"-E13","v":0},{"$f":"F13","v":0},{"$f":"-G13","v":-5.8364661654135416E-4},{"$f":"H13","v":0.10370300751879696},{"$f":"-I13","v":-1.1672932330827083E-3},{"$f":"J13","v":0.20740601503759393},{"$f":"-K13","v":-1.7509398496240584E-3},{"$f":"L13","v":0.31110902255639072},{"$f":"-M13","v":-2.3345864661654166E-3},{"$f":"N13","v":0.41481203007518785},{"$f":"-O13","v":-2.9182330827067825E-3},{"$f":"P13","v":0.51851503759398454},{"$f":"-Q13","v":-3.5018796992481167E-3},{"$f":"R13","v":0.62221804511278145},{"$f":"-S13","v":-4.0855263157894674E-3},{"$f":"T13","v":0.72592105263157847},{"$f":"-U13","v":-4.6691729323308333E-3},{"$f":"V13","v":0.82962406015037571},{"$f":"-W13","v":-5.2528195488721679E-3},{"$f":"X13","v":0.93332706766917239},{"$f":"-Y13","v":-5.836466165413565E-3},{"$f":"Z13","v":1.0370300751879691},{"$f":"-AA13","v":-6.4201127819549005E-3},{"$f":"AB13","v":1.1407330827067663},{"$f":"-AC13","v":-7.0037593984962334E-3},{"$f":"AD13","v":1.2444360902255629},{"$f":"-AE13","v":-7.587406015037601E-3},{"$f":"AF13","v":1.3481390977443599},{"$f":"-AG13","v":-8.1710526315789348E-3},{"$f":"AH13","v":1.4518421052631569},{"$f":"-AI13","v":-8.7546992481202686E-3},{"$f":"AJ13","v":1.555545112781954},{"$f":"-AK13","v":-9.3383458646616666E-3},{"$f":"AL13","v":1.6592481203007514},{"$f":"-AM13","v":-9.9219924812030021E-3},{"$f":"AN13","v":1.7629511278195475},{"$f":"-AO13","v":-1.0505639097744336E-2},{"$f":"AP13","v":1.8666541353383448},{"$f":"-AQ13","v":-1.1089285714285732E-2},{"$f":"AR13","v":1.9703571428571416},{"$f":"-AS13","v":-1.167293233082713E-2},{"$f":"AT13","v":2.0740601503759382},{"$f":"-AU13","v":-1.4591165413533991E-2},{"$f":"AV13","v":2.5925751879699224}]
[null,1,{"$f":"E12/2","v":0},{"$f":"-0.25+F12/2","v":-0.25},0,0,0,0.10499999999999997,0,0.20999999999999994,0,0.31499999999999978,0,0.41999999999999987,0,0.52499999999999969,0,0.62999999999999956,0,0.73499999999999954,0,0.83999999999999975,0,0.94499999999999951,0,1.0499999999999994,0,1.1549999999999994,0,1.2599999999999991,0,1.3649999999999991,0,1.4699999999999991,0,1.5749999999999991,0,1.6799999999999995,0,1.7849999999999986,0,1.889999999999999,0,1.9949999999999986,0,2.0999999999999988,{"$f":"2*AS12-AI12","v":0},{"$f":"2*AT12-AJ12","v":2.6249999999999982}]
[null,2,{"$f":"E13/2","v":0},{"$f":"-0.25+F13/2","v":-0.25},0,0,5.8364661654135416E-4,0.10370300751879696,1.1672932330827083E-3,0.20740601503759393,1.7509398496240584E-3,0.31110902255639072,2.3345864661654166E-3,0.41481203007518785,2.9182330827067825E-3,0.51851503759398454,3.5018796992481167E-3,0.62221804511278145,4.0855263157894674E-3,0.72592105263157847,4.6691729323308333E-3,0.82962406015037571,5.2528195488721679E-3,0.93332706766917239,5.836466165413565E-3,1.0370300751879691,6.4201127819549005E-3,1.1407330827067663,7.0037593984962334E-3,1.2444360902255629,7.587406015037601E-3,1.3481390977443599,8.1710526315789348E-3,1.4518421052631569,8.7546992481202686E-3,1.555545112781954,9.3383458646616666E-3,1.6592481203007514,9.9219924812030021E-3,1.7629511278195475,1.0505639097744336E-2,1.8666541353383448,1.1089285714285732E-2,1.9703571428571416,1.167293233082713E-2,2.0740601503759382,{"$f":"2*AS13-AI13","v":1.4591165413533991E-2},{"$f":"2*AT13-AJ13","v":2.5925751879699224}]
[null,3,0,-0.25,0,0,1.0006578947368434E-2,8.2763157894736789E-2,2.0013157894736868E-2,0.16552631578947358,3.0019736842105283E-2,0.24828947368421023,4.0026315789473736E-2,0.33105263157894715,5.0032894736842151E-2,0.41381578947368375,6.0039473684210566E-2,0.49657894736842045,7.0046052631578995E-2,0.57934210526315733,8.0052631578947472E-2,0.66210526315789431,9.0059210526315867E-2,0.74486842105263085,0.1000657894736843,0.8276315789473675,0.11007236842105272,0.91039473684210459,0.12007894736842113,0.99315789473684091,0.13008552631578954,1.0759210526315779,0.14009210526315799,1.1586842105263147,0.15009868421052641,1.2414473684210514,0.16010526315789494,1.3242105263157886,0.17011184210526323,1.4069736842105249,0.18011842105263173,1.4897368421052617,0.19012500000000007,1.5724999999999985,0.2001315789473686,1.655263157894735,0.2501644736842108,2.0690789473684186]
[null,4,5.0700953471259755E-4,-0.25102426168628805,1.0140190694251951E-3,-2.0485233725761514E-3,1.4452440122056744E-2,7.3088318732687049E-2,2.7890861174688295E-2,0.14822516083795023,4.1329282227319832E-2,0.22336200294321332,5.4767703279951396E-2,0.29849884504847662,6.8206124332582913E-2,0.37363568715373963,8.1644545385214443E-2,0.44877252925900285,9.5082966437846E-2,0.52390937136426596,0.10852138749047759,0.59904621346952946,0.12195980854310912,0.67418305557479241,0.13539822959574066,0.74931989768005558,0.14883665064837218,0.82445673978531886,0.16227507170100366,0.89959358189058169,0.17571349275363529,0.97473042399584509,0.18915191380626678,1.0498672661011081,0.20259033485889835,1.1250041082063715,0.21602875591152995,1.2001409503116349,0.22946717696416138,1.2752777924168976,0.24290559801679301,1.350414634522161,0.2563440190694245,1.4255514766274238,0.2697824401220561,1.5006883187326872,0.33697454538521388,1.8763725292590028]
{"$rows_left_out":77}